Taxon,"Gene ID","Gene Symbol",Transcript,"Clone ID","Legacy Clone Name","Target Seq",Vector,"Match Position","Match Region","Match %","SDR Match %","Intrinsic Score","Adjusted Score","Matches Other Gene in Same Taxon?","Orig. Target Gene ID","Orig. Target Gene Symbol","Forward Oligo Sequence","Reverse Oligo Sequence",Addgene
human,6715,SRD5A1,NM_001324323.2,TRCN0000230329,NM_001047.2-1199s21c1,GGGTAATAACTGCTGATATTT,pLKO_005,1648,3UTR,100,100,15,9,N,6715,SRD5A1,CCGGGGGTAATAACTGCTGATATTTCTCGAGAAATATCAGCAGTTATTACCCTTTTTG,AATTCAAAAAGGGTAATAACTGCTGATATTTCTCGAGAAATATCAGCAGTTATTACCC,n/a
human,6715,SRD5A1,NM_001324323.2,TRCN0000230328,NM_001047.2-559s21c1,CTGTACCTGTAACGGCTATTT,pLKO_005,1008,CDS,100,100,13.2,7.92,N,6715,SRD5A1,CCGGCTGTACCTGTAACGGCTATTTCTCGAGAAATAGCCGTTACAGGTACAGTTTTTG,AATTCAAAAACTGTACCTGTAACGGCTATTTCTCGAGAAATAGCCGTTACAGGTACAG,n/a
human,6715,SRD5A1,NM_001324323.2,TRCN0000230327,NM_001047.2-536s21c1,GCGTGTACAATGGCGATTATG,pLKO_005,985,CDS,100,100,13.2,7.92,N,6715,SRD5A1,CCGGGCGTGTACAATGGCGATTATGCTCGAGCATAATCGCCATTGTACACGCTTTTTG,AATTCAAAAAGCGTGTACAATGGCGATTATGCTCGAGCATAATCGCCATTGTACACGC,n/a
human,6715,SRD5A1,NM_001324323.2,TRCN0000026585,NM_001047.1-659s1c1,CCAGGAGATACTGGATACAAA,pLKO.1,1171,CDS,100,100,5.625,3.375,N,6715,SRD5A1,CCGGCCAGGAGATACTGGATACAAACTCGAGTTTGTATCCAGTATCTCCTGGTTTTTG,AATTCAAAAACCAGGAGATACTGGATACAAACTCGAGTTTGTATCCAGTATCTCCTGG,n/a
human,6715,SRD5A1,NM_001324323.2,TRCN0000026562,NM_001047.1-508s1c1,CGGCTATTTGCAAAGCAGATA,pLKO.1,1020,CDS,100,100,4.95,2.97,N,6715,SRD5A1,CCGGCGGCTATTTGCAAAGCAGATACTCGAGTATCTGCTTTGCAAATAGCCGTTTTTG,AATTCAAAAACGGCTATTTGCAAAGCAGATACTCGAGTATCTGCTTTGCAAATAGCCG,n/a
human,6715,SRD5A1,NM_001324323.2,TRCN0000026546,NM_001047.1-690s1c1,GAGGCTTATTTGAATACGTAA,pLKO.1,1202,CDS,100,100,4.95,2.97,N,6715,SRD5A1,CCGGGAGGCTTATTTGAATACGTAACTCGAGTTACGTATTCAAATAAGCCTCTTTTTG,AATTCAAAAAGAGGCTTATTTGAATACGTAACTCGAGTTACGTATTCAAATAAGCCTC,n/a
human,6715,SRD5A1,NM_001324323.2,TRCN0000218975,NM_001047.2-688s21c1,CCATTCAGATCATATCCTAAG,pLKO_005,1137,CDS,100,100,6,3,Y,6715,SRD5A1,CCGGCCATTCAGATCATATCCTAAGCTCGAGCTTAGGATATGATCTGAATGGTTTTTG,AATTCAAAAACCATTCAGATCATATCCTAAGCTCGAGCTTAGGATATGATCTGAATGG,n/a
human,6715,SRD5A1,NM_001324323.2,TRCN0000026523,NM_001047.1-847s1c1,CCTCCGGAAATTTGAAGAGTA,pLKO.1,1359,CDS,100,100,4.95,2.475,Y,6715,SRD5A1,CCGGCCTCCGGAAATTTGAAGAGTACTCGAGTACTCTTCAAATTTCCGGAGGTTTTTG,AATTCAAAAACCTCCGGAAATTTGAAGAGTACTCGAGTACTCTTCAAATTTCCGGAGG,n/a
human,6715,SRD5A1,NM_001324323.2,TRCN0000165027,NM_001013636.1-513s1c1,GAACTCCTGACCTCAAGTGAT,pLKO.1,5646,3UTR,100,100,4.95,2.475,Y,387873,LOC387873,CCGGGAACTCCTGACCTCAAGTGATCTCGAGATCACTTGAGGTCAGGAGTTCTTTTTG,AATTCAAAAAGAACTCCTGACCTCAAGTGATCTCGAGATCACTTGAGGTCAGGAGTTC,n/a
human,6715,SRD5A1,NM_001324323.2,TRCN0000165534,NM_001012717.1-362s1c1,GAGACAGGGTTTCACCATGTT,pLKO.1,5610,3UTR,100,100,4.95,2.475,Y,,,CCGGGAGACAGGGTTTCACCATGTTCTCGAGAACATGGTGAAACCCTGTCTCTTTTTG,AATTCAAAAAGAGACAGGGTTTCACCATGTTCTCGAGAACATGGTGAAACCCTGTCTC,n/a
