Taxon,"Gene ID","Gene Symbol",Transcript,"Clone ID","Legacy Clone Name","Target Seq",Vector,"Match Position","Match Region","Match %","SDR Match %","Intrinsic Score","Adjusted Score","Matches Other Gene in Same Taxon?","Orig. Target Gene ID","Orig. Target Gene Symbol","Forward Oligo Sequence","Reverse Oligo Sequence",Addgene
human,7135,TNNI1,NM_003281.4,TRCN0000435500,NM_003281.3-1010s21c1,CATCACACCTTCTTCATTAAA,pLKO_005,994,3UTR,100,100,15,10.5,N,7135,TNNI1,CCGGCATCACACCTTCTTCATTAAACTCGAGTTTAATGAAGAAGGTGTGATGTTTTTG,AATTCAAAAACATCACACCTTCTTCATTAAACTCGAGTTTAATGAAGAAGGTGTGATG,n/a
human,7135,TNNI1,NM_003281.4,TRCN0000419967,NM_003281.3-333s21c1,ATACGACATTGAGGCCAAATG,pLKO_005,317,CDS,100,100,10.8,7.56,N,7135,TNNI1,CCGGATACGACATTGAGGCCAAATGCTCGAGCATTTGGCCTCAATGTCGTATTTTTTG,AATTCAAAAAATACGACATTGAGGCCAAATGCTCGAGCATTTGGCCTCAATGTCGTAT,n/a
human,7135,TNNI1,NM_003281.4,TRCN0000161772,NM_003281.2-499s1c1,CAAGTCTGTGAAGAAGGAAGA,pLKO.1,503,CDS,100,100,4.05,2.835,N,7135,TNNI1,CCGGCAAGTCTGTGAAGAAGGAAGACTCGAGTCTTCCTTCTTCACAGACTTGTTTTTG,AATTCAAAAACAAGTCTGTGAAGAAGGAAGACTCGAGTCTTCCTTCTTCACAGACTTG,n/a
human,7135,TNNI1,NM_003281.4,TRCN0000161904,NM_003281.2-352s1c1,GATTAAGGACCTGAAGCTGAA,pLKO.1,356,CDS,100,100,4.05,2.835,N,7135,TNNI1,CCGGGATTAAGGACCTGAAGCTGAACTCGAGTTCAGCTTCAGGTCCTTAATCTTTTTG,AATTCAAAAAGATTAAGGACCTGAAGCTGAACTCGAGTTCAGCTTCAGGTCCTTAATC,n/a
human,7135,TNNI1,NM_003281.4,TRCN0000164326,NM_003281.2-616s1c1,CAAGTCTCCGACCTCACAATA,pLKO.1,620,CDS,100,100,13.2,7.92,N,7135,TNNI1,CCGGCAAGTCTCCGACCTCACAATACTCGAGTATTGTGAGGTCGGAGACTTGTTTTTG,AATTCAAAAACAAGTCTCCGACCTCACAATACTCGAGTATTGTGAGGTCGGAGACTTG,n/a
human,7135,TNNI1,NM_003281.4,TRCN0000161465,NM_003281.2-508s1c1,GAAGAAGGAAGACACAGAGAA,pLKO.1,512,CDS,100,100,4.95,2.97,N,7135,TNNI1,CCGGGAAGAAGGAAGACACAGAGAACTCGAGTTCTCTGTGTCTTCCTTCTTCTTTTTG,AATTCAAAAAGAAGAAGGAAGACACAGAGAACTCGAGTTCTCTGTGTCTTCCTTCTTC,n/a
human,7135,TNNI1,NM_003281.4,TRCN0000165534,NM_001012717.1-362s1c1,GAGACAGGGTTTCACCATGTT,pLKO.1,2018,3UTR,100,100,4.95,2.475,Y,,,CCGGGAGACAGGGTTTCACCATGTTCTCGAGAACATGGTGAAACCCTGTCTCTTTTTG,AATTCAAAAAGAGACAGGGTTTCACCATGTTCTCGAGAACATGGTGAAACCCTGTCTC,n/a
human,7135,TNNI1,NM_003281.4,TRCN0000163448,NM_003281.2-591s1c1,GCCGGAAGAAGATGTTTGATG,pLKO.1,595,CDS,100,100,4.95,2.475,Y,7135,TNNI1,CCGGGCCGGAAGAAGATGTTTGATGCTCGAGCATCAAACATCTTCTTCCGGCTTTTTG,AATTCAAAAAGCCGGAAGAAGATGTTTGATGCTCGAGCATCAAACATCTTCTTCCGGC,n/a
human,7135,TNNI1,NM_003281.4,TRCN0000116227,NM_024930.1-2895s1c1,CCTCCCAAAGTTCTGGGATTA,pLKO.1,2086,3UTR,100,100,1.08,.54,Y,79993,ELOVL7,CCGGCCTCCCAAAGTTCTGGGATTACTCGAGTAATCCCAGAACTTTGGGAGGTTTTTG,AATTCAAAAACCTCCCAAAGTTCTGGGATTACTCGAGTAATCCCAGAACTTTGGGAGG,n/a
human,7135,TNNI1,NM_003281.4,TRCN0000164591,NM_003281.3-2102s1c1,CCTCCCAAAGTTCTGGGATTA,pLKO.1,2086,3UTR,100,100,1.08,.54,Y,7135,TNNI1,CCGGCCTCCCAAAGTTCTGGGATTACTCGAGTAATCCCAGAACTTTGGGAGGTTTTTG,AATTCAAAAACCTCCCAAAGTTCTGGGATTACTCGAGTAATCCCAGAACTTTGGGAGG,n/a
