Taxon,"Gene ID","Gene Symbol",Transcript,"Clone ID","Legacy Clone Name","Target Seq",Vector,"Match Position","Match Region","Match %","SDR Match %","Intrinsic Score","Adjusted Score","Matches Other Gene in Same Taxon?","Orig. Target Gene ID","Orig. Target Gene Symbol","Forward Oligo Sequence","Reverse Oligo Sequence",Addgene
human,4117,MAK,XM_017010865.1,TRCN0000001787,NM_005906.x-806s1c1,CTCTATATGTTAAGGCCACTT,pLKO.1,928,CDS,100,100,4.05,5.67,N,4117,MAK,CCGGCTCTATATGTTAAGGCCACTTCTCGAGAAGTGGCCTTAACATATAGAGTTTTTG,AATTCAAAAACTCTATATGTTAAGGCCACTTCTCGAGAAGTGGCCTTAACATATAGAG,n/a
human,4117,MAK,XM_017010865.1,TRCN0000001788,NM_005906.x-1107s1c1,CGTCAAATCATCTGGAATCAA,pLKO.1,1229,CDS,100,100,5.625,4.5,N,4117,MAK,CCGGCGTCAAATCATCTGGAATCAACTCGAGTTGATTCCAGATGATTTGACGTTTTTG,AATTCAAAAACGTCAAATCATCTGGAATCAACTCGAGTTGATTCCAGATGATTTGACG,n/a
human,4117,MAK,XM_017010865.1,TRCN0000194697,NM_005906.3-3133s1c1,CTTGATGACTTCAATAGTAAC,pLKO.1,3135,3UTR,100,100,10.8,7.56,N,4117,MAK,CCGGCTTGATGACTTCAATAGTAACCTCGAGGTTACTATTGAAGTCATCAAGTTTTTG,AATTCAAAAACTTGATGACTTCAATAGTAACCTCGAGGTTACTATTGAAGTCATCAAG,n/a
human,4117,MAK,XM_017010865.1,TRCN0000001789,NM_005906.x-982s1c1,CAATGCCAGTAATGAAGCTAT,pLKO.1,1104,CDS,100,100,4.95,3.465,N,4117,MAK,CCGGCAATGCCAGTAATGAAGCTATCTCGAGATAGCTTCATTACTGGCATTGTTTTTG,AATTCAAAAACAATGCCAGTAATGAAGCTATCTCGAGATAGCTTCATTACTGGCATTG,n/a
human,4117,MAK,XM_017010865.1,TRCN0000195056,NM_005906.3-2657s1c1,CGATGGTAATTTCAATCTTGA,pLKO.1,2659,3UTR,100,100,4.95,3.465,N,4117,MAK,CCGGCGATGGTAATTTCAATCTTGACTCGAGTCAAGATTGAAATTACCATCGTTTTTG,AATTCAAAAACGATGGTAATTTCAATCTTGACTCGAGTCAAGATTGAAATTACCATCG,n/a
human,4117,MAK,XM_017010865.1,TRCN0000001785,NM_005906.x-2562s1c1,GCTGTGGTTCTTATTTGACTA,pLKO.1,2564,3UTR,100,100,4.95,3.465,N,4117,MAK,CCGGGCTGTGGTTCTTATTTGACTACTCGAGTAGTCAAATAAGAACCACAGCTTTTTG,AATTCAAAAAGCTGTGGTTCTTATTTGACTACTCGAGTAGTCAAATAAGAACCACAGC,n/a
human,4117,MAK,XM_017010865.1,TRCN0000194976,NM_005906.3-1169s1c1,CCATCTTTAGTTGAGGTAGAG,pLKO.1,1291,CDS,100,100,4.05,2.835,N,4117,MAK,CCGGCCATCTTTAGTTGAGGTAGAGCTCGAGCTCTACCTCAACTAAAGATGGTTTTTG,AATTCAAAAACCATCTTTAGTTGAGGTAGAGCTCGAGCTCTACCTCAACTAAAGATGG,n/a
human,4117,MAK,XM_017010865.1,TRCN0000430981,NM_173537.2-3266s21c1,GCCACCATGCCTGGCTAATTT,pLKO_005,2836,3UTR,100,100,15,7.5,Y,84163,GTF2IRD2,CCGGGCCACCATGCCTGGCTAATTTCTCGAGAAATTAGCCAGGCATGGTGGCTTTTTG,AATTCAAAAAGCCACCATGCCTGGCTAATTTCTCGAGAAATTAGCCAGGCATGGTGGC,n/a
human,4117,MAK,XM_017010865.1,TRCN0000165534,NM_001012717.1-362s1c1,GAGACAGGGTTTCACCATGTT,pLKO.1,2871,3UTR,100,100,4.95,2.475,Y,,,CCGGGAGACAGGGTTTCACCATGTTCTCGAGAACATGGTGAAACCCTGTCTCTTTTTG,AATTCAAAAAGAGACAGGGTTTCACCATGTTCTCGAGAACATGGTGAAACCCTGTCTC,n/a
