Taxon,"Gene ID","Gene Symbol",Transcript,"Clone ID","Legacy Clone Name","Target Seq",Vector,"Match Position","Match Region","Match %","SDR Match %","Intrinsic Score","Adjusted Score","Matches Other Gene in Same Taxon?","Orig. Target Gene ID","Orig. Target Gene Symbol","Forward Oligo Sequence","Reverse Oligo Sequence",Addgene
human,105378589,LOC105378589,XR_001737843.2,TRCN0000165027,NM_001013636.1-513s1c1,GAACTCCTGACCTCAAGTGAT,pLKO.1,1518,3UTR,100,100,4.95,2.475,Y,387873,LOC387873,CCGGGAACTCCTGACCTCAAGTGATCTCGAGATCACTTGAGGTCAGGAGTTCTTTTTG,AATTCAAAAAGAACTCCTGACCTCAAGTGATCTCGAGATCACTTGAGGTCAGGAGTTC,n/a
human,105378589,LOC105378589,XR_001737843.2,TRCN0000165534,NM_001012717.1-362s1c1,GAGACAGGGTTTCACCATGTT,pLKO.1,1482,3UTR,100,100,4.95,2.475,Y,,,CCGGGAGACAGGGTTTCACCATGTTCTCGAGAACATGGTGAAACCCTGTCTCTTTTTG,AATTCAAAAAGAGACAGGGTTTCACCATGTTCTCGAGAACATGGTGAAACCCTGTCTC,n/a
human,105378589,LOC105378589,XR_001737843.2,TRCN0000140719,NM_006455.2-2048s1c1,GATCACTTGAGGTCAGGAGTT,pLKO.1,3735,3UTR,100,100,4.05,2.025,Y,10609,P3H4,CCGGGATCACTTGAGGTCAGGAGTTCTCGAGAACTCCTGACCTCAAGTGATCTTTTTG,AATTCAAAAAGATCACTTGAGGTCAGGAGTTCTCGAGAACTCCTGACCTCAAGTGATC,n/a
human,105378589,LOC105378589,XR_001737843.2,TRCN0000165299,NM_032831.1-2295s1c1,GATCACTTGAGGTCAGGAGTT,pLKO.1,3735,3UTR,100,100,4.05,2.025,Y,80228,ORAI2,CCGGGATCACTTGAGGTCAGGAGTTCTCGAGAACTCCTGACCTCAAGTGATCTTTTTG,AATTCAAAAAGATCACTTGAGGTCAGGAGTTCTCGAGAACTCCTGACCTCAAGTGATC,n/a
human,105378589,LOC105378589,XR_001737843.2,TRCN0000352971,NM_006455.2-2048s21c1,GATCACTTGAGGTCAGGAGTT,pLKO_005,3735,3UTR,100,100,4.05,2.025,Y,10609,P3H4,CCGGGATCACTTGAGGTCAGGAGTTCTCGAGAACTCCTGACCTCAAGTGATCTTTTTG,AATTCAAAAAGATCACTTGAGGTCAGGAGTTCTCGAGAACTCCTGACCTCAAGTGATC,n/a
human,105378589,LOC105378589,XR_001737843.2,TRCN0000155836,NM_198582.1-3275s1c1,CCCAAAGTGCTGGGATTACAA,pLKO.1,40,3UTR,95,100,5.625,2.8125,Y,377007,KLHL30,CCGGCCCAAAGTGCTGGGATTACAACTCGAGTTGTAATCCCAGCACTTTGGGTTTTTG,AATTCAAAAACCCAAAGTGCTGGGATTACAACTCGAGTTGTAATCCCAGCACTTTGGG,n/a
human,105378589,LOC105378589,XR_001737843.2,TRCN0000148469,NM_152459.2-1181s1c1,CTGGGTTCAAGCAATTCTCTT,pLKO.1,1389,3UTR,95,100,4.95,2.475,Y,146556,C16orf89,CCGGCTGGGTTCAAGCAATTCTCTTCTCGAGAAGAGAATTGCTTGAACCCAGTTTTTG,AATTCAAAAACTGGGTTCAAGCAATTCTCTTCTCGAGAAGAGAATTGCTTGAACCCAG,n/a
human,105378589,LOC105378589,XR_001737843.2,TRCN0000141025,NM_152361.1-835s1c1,CCCAAAGTGCTGGGATTACTT,pLKO.1,40,3UTR,90,100,5.625,2.8125,Y,126272,EID2B,CCGGCCCAAAGTGCTGGGATTACTTCTCGAGAAGTAATCCCAGCACTTTGGGTTTTTG,AATTCAAAAACCCAAAGTGCTGGGATTACTTCTCGAGAAGTAATCCCAGCACTTTGGG,n/a
