Taxon,"Gene ID","Gene Symbol",Transcript,"Clone ID","Legacy Clone Name","Target Seq",Vector,"Match Position","Match Region","Match %","SDR Match %","Intrinsic Score","Adjusted Score","Matches Other Gene in Same Taxon?","Orig. Target Gene ID","Orig. Target Gene Symbol","Forward Oligo Sequence","Reverse Oligo Sequence",Addgene
human,284001,CCDC57,XR_001752491.1,TRCN0000139389,NM_152675.1-297s1c1,CACACGGTGACCTGTAAATCA,pLKO.1,9148,3UTR,100,100,5.625,7.875,N,284001,CCDC57,CCGGCACACGGTGACCTGTAAATCACTCGAGTGATTTACAGGTCACCGTGTGTTTTTG,AATTCAAAAACACACGGTGACCTGTAAATCACTCGAGTGATTTACAGGTCACCGTGTG,n/a
human,284001,CCDC57,XR_001752491.1,TRCN0000167936,NM_198082.1-962s1c1,CGGGAGCTTAAGGTTAAACTA,pLKO.1,900,3UTR,100,100,5.625,7.875,N,284001,CCDC57,CCGGCGGGAGCTTAAGGTTAAACTACTCGAGTAGTTTAACCTTAAGCTCCCGTTTTTG,AATTCAAAAACGGGAGCTTAAGGTTAAACTACTCGAGTAGTTTAACCTTAAGCTCCCG,n/a
human,284001,CCDC57,XR_001752491.1,TRCN0000166945,NM_198082.1-2156s1c1,GAAGATGTGTTGGATCCTTTA,pLKO.1,2277,3UTR,100,100,10.8,7.56,N,284001,CCDC57,CCGGGAAGATGTGTTGGATCCTTTACTCGAGTAAAGGATCCAACACATCTTCTTTTTG,AATTCAAAAAGAAGATGTGTTGGATCCTTTACTCGAGTAAAGGATCCAACACATCTTC,n/a
human,284001,CCDC57,XR_001752491.1,TRCN0000167622,NM_198082.1-1445s1c1,GATGCTCAAATTGCTCAACTA,pLKO.1,1729,3UTR,100,100,4.95,3.465,N,284001,CCDC57,CCGGGATGCTCAAATTGCTCAACTACTCGAGTAGTTGAGCAATTTGAGCATCTTTTTG,AATTCAAAAAGATGCTCAAATTGCTCAACTACTCGAGTAGTTGAGCAATTTGAGCATC,n/a
human,284001,CCDC57,XR_001752491.1,TRCN0000167776,NM_198082.1-1190s1c1,GAAACATTTAAGAGGAAGCAT,pLKO.1,1128,3UTR,100,100,3,2.1,N,284001,CCDC57,CCGGGAAACATTTAAGAGGAAGCATCTCGAGATGCTTCCTCTTAAATGTTTCTTTTTG,AATTCAAAAAGAAACATTTAAGAGGAAGCATCTCGAGATGCTTCCTCTTAAATGTTTC,n/a
human,284001,CCDC57,XR_001752491.1,TRCN0000140537,NM_152675.1-278s1c1,GAAGACACAACACAGCATCCA,pLKO.1,9129,3UTR,100,100,2.64,1.848,N,284001,CCDC57,CCGGGAAGACACAACACAGCATCCACTCGAGTGGATGCTGTGTTGTGTCTTCTTTTTG,AATTCAAAAAGAAGACACAACACAGCATCCACTCGAGTGGATGCTGTGTTGTGTCTTC,n/a
human,284001,CCDC57,XR_001752491.1,TRCN0000165534,NM_001012717.1-362s1c1,GAGACAGGGTTTCACCATGTT,pLKO.1,4336,3UTR,100,100,4.95,2.475,Y,,,CCGGGAGACAGGGTTTCACCATGTTCTCGAGAACATGGTGAAACCCTGTCTCTTTTTG,AATTCAAAAAGAGACAGGGTTTCACCATGTTCTCGAGAACATGGTGAAACCCTGTCTC,n/a
human,284001,CCDC57,XR_001752491.1,TRCN0000173053,NM_198082.1-1549s1c1,CCAGCAGGACATTGAAAGGTA,pLKO.1,1833,3UTR,95,100,3,4.2,N,284001,CCDC57,CCGGCCAGCAGGACATTGAAAGGTACTCGAGTACCTTTCAATGTCCTGCTGGTTTTTG,AATTCAAAAACCAGCAGGACATTGAAAGGTACTCGAGTACCTTTCAATGTCCTGCTGG,n/a
human,284001,CCDC57,XR_001752491.1,TRCN0000106345,NM_030176.2-2044s1c1,GCAGCTAACCAGGAAGAAGTT,pLKO.1,1103,3UTR,90,100,4.95,3.465,N,78779,Spata2l,CCGGGCAGCTAACCAGGAAGAAGTTCTCGAGAACTTCTTCCTGGTTAGCTGCTTTTTG,AATTCAAAAAGCAGCTAACCAGGAAGAAGTTCTCGAGAACTTCTTCCTGGTTAGCTGC,n/a
