Taxon,"Gene ID","Gene Symbol",Transcript,"Clone ID","Legacy Clone Name","Target Seq",Vector,"Match Position","Match Region","Match %","SDR Match %","Intrinsic Score","Adjusted Score","Matches Other Gene in Same Taxon?","Orig. Target Gene ID","Orig. Target Gene Symbol","Forward Oligo Sequence","Reverse Oligo Sequence",Addgene
human,117154,DACH2,NM_001139515.1,TRCN0000415375,NM_053281.3-1537s21c1,AGACTCTGTTGACCAACATTC,pLKO_005,923,CDS,100,100,10.8,15.12,N,117154,DACH2,CCGGAGACTCTGTTGACCAACATTCCTCGAGGAATGTTGGTCAACAGAGTCTTTTTTG,AATTCAAAAAAGACTCTGTTGACCAACATTCCTCGAGGAATGTTGGTCAACAGAGTCT,n/a
human,117154,DACH2,NM_001139515.1,TRCN0000020813,NM_053281.2-1749s1c1,AGGAGGTAACTATTACTGTTT,pLKO.1,1305,CDS,100,100,4.95,6.93,N,117154,DACH2,CCGGAGGAGGTAACTATTACTGTTTCTCGAGAAACAGTAATAGTTACCTCCTTTTTTG,AATTCAAAAAAGGAGGTAACTATTACTGTTTCTCGAGAAACAGTAATAGTTACCTCCT,n/a
human,117154,DACH2,NM_001139515.1,TRCN0000417908,NM_053281.3-2163s21c1,CATTAGACTGACCAGTTTAAA,pLKO_005,1549,3UTR,100,100,15,10.5,N,117154,DACH2,CCGGCATTAGACTGACCAGTTTAAACTCGAGTTTAAACTGGTCAGTCTAATGTTTTTG,AATTCAAAAACATTAGACTGACCAGTTTAAACTCGAGTTTAAACTGGTCAGTCTAATG,n/a
human,117154,DACH2,NM_001139515.1,TRCN0000020810,NM_053281.2-1207s1c1,CCCTCTCAGATGGATCATCAT,pLKO.1,763,CDS,100,100,4.95,3.465,N,117154,DACH2,CCGGCCCTCTCAGATGGATCATCATCTCGAGATGATGATCCATCTGAGAGGGTTTTTG,AATTCAAAAACCCTCTCAGATGGATCATCATCTCGAGATGATGATCCATCTGAGAGGG,n/a
human,117154,DACH2,NM_001139515.1,TRCN0000020811,NM_053281.2-943s1c1,CCATTTATGATGATGCCTCAT,pLKO.1,499,CDS,100,100,4.05,2.835,N,117154,DACH2,CCGGCCATTTATGATGATGCCTCATCTCGAGATGAGGCATCATCATAAATGGTTTTTG,AATTCAAAAACCATTTATGATGATGCCTCATCTCGAGATGAGGCATCATCATAAATGG,n/a
human,117154,DACH2,NM_001139515.1,TRCN0000108578,NM_033605.2-1400s1c1,CCTCGCAGATGGATCATCATT,pLKO.1,764,CDS,95,95,,,N,93837,Dach2,CCGGCCTCGCAGATGGATCATCATTCTCGAGAATGATGATCCATCTGCGAGGTTTTTG,AATTCAAAAACCTCGCAGATGGATCATCATTCTCGAGAATGATGATCCATCTGCGAGG,n/a
human,117154,DACH2,NM_001139515.1,TRCN0000198846,NM_026964.2-127s1c1,CAAGAAACAGAAGGAGCTGGA,pLKO.1,1000,CDS,85,95,,,Y,234388,Ccdc124,CCGGCAAGAAACAGAAGGAGCTGGACTCGAGTCCAGCTCCTTCTGTTTCTTGTTTTTG,AATTCAAAAACAAGAAACAGAAGGAGCTGGACTCGAGTCCAGCTCCTTCTGTTTCTTG,n/a
human,117154,DACH2,NM_001139515.1,TRCN0000422179,NM_033605.2-2108s21c1,TACTTGTGATTCCAGTATATC,pLKO_005,1388,3UTR,90,89,,,Y,93837,Dach2,CCGGTACTTGTGATTCCAGTATATCCTCGAGGATATACTGGAATCACAAGTATTTTTG,AATTCAAAAATACTTGTGATTCCAGTATATCCTCGAGGATATACTGGAATCACAAGTA,n/a
human,117154,DACH2,NM_001139515.1,TRCN0000144631,NM_018246.1-659s1c1,GATGGCAATGATTCAGATGAA,pLKO.1,558,CDS,90,89,,,Y,55246,CCDC25,CCGGGATGGCAATGATTCAGATGAACTCGAGTTCATCTGAATCATTGCCATCTTTTTG,AATTCAAAAAGATGGCAATGATTCAGATGAACTCGAGTTCATCTGAATCATTGCCATC,n/a
human,117154,DACH2,NM_001139515.1,TRCN0000016900,NM_024336.1-965s1c1,GCGCCTCAAGAAGGAGAATAA,pLKO.1,1107,CDS,90,89,,,Y,79191,IRX3,CCGGGCGCCTCAAGAAGGAGAATAACTCGAGTTATTCTCCTTCTTGAGGCGCTTTTTG,AATTCAAAAAGCGCCTCAAGAAGGAGAATAACTCGAGTTATTCTCCTTCTTGAGGCGC,n/a
human,117154,DACH2,NM_001139515.1,TRCN0000009104,NM_000869.1-893s1c1,GCAGTAACTACTATGCAGAAA,pLKO.1,1088,CDS,85,89,,,Y,3359,HTR3A,CCGGGCAGTAACTACTATGCAGAAACTCGAGTTTCTGCATAGTAGTTACTGCTTTTTG,AATTCAAAAAGCAGTAACTACTATGCAGAAACTCGAGTTTCTGCATAGTAGTTACTGC,n/a
human,117154,DACH2,NM_001139515.1,TRCN0000362601,NM_008601.3-360s21c1,TATGGCTATGCTCACTCTTAA,pLKO_005,249,CDS,85,89,,,Y,17342,Mitf,CCGGTATGGCTATGCTCACTCTTAACTCGAGTTAAGAGTGAGCATAGCCATATTTTTG,AATTCAAAAATATGGCTATGCTCACTCTTAACTCGAGTTAAGAGTGAGCATAGCCATA,n/a
human,117154,DACH2,NM_001139515.1,TRCN0000305311,NM_001081223.1-1772s21c1,ACTTAAGCAAGCCACTATTTA,pLKO_005,1194,CDS,80,89,,,N,225182,Rbbp8,CCGGACTTAAGCAAGCCACTATTTACTCGAGTAAATAGTGGCTTGCTTAAGTTTTTTG,AATTCAAAAAACTTAAGCAAGCCACTATTTACTCGAGTAAATAGTGGCTTGCTTAAGT,n/a
human,117154,DACH2,NM_001139515.1,TRCN0000017163,NM_080725.1-417s1c1,AGTCCACTCTCTCAGACCTAA,pLKO.1,625,CDS,80,89,,,Y,140809,SRXN1,CCGGAGTCCACTCTCTCAGACCTAACTCGAGTTAGGTCTGAGAGAGTGGACTTTTTTG,AATTCAAAAAAGTCCACTCTCTCAGACCTAACTCGAGTTAGGTCTGAGAGAGTGGACT,n/a
human,117154,DACH2,NM_001139515.1,TRCN0000014070,NM_016944.1-705s1c1,CCTCATCCTCTACATTCCATA,pLKO.1,514,CDS,80,89,,,Y,50832,TAS2R4,CCGGCCTCATCCTCTACATTCCATACTCGAGTATGGAATGTAGAGGATGAGGTTTTTG,AATTCAAAAACCTCATCCTCTACATTCCATACTCGAGTATGGAATGTAGAGGATGAGG,n/a
human,117154,DACH2,NM_001139515.1,TRCN0000158924,NM_001004299.1-810s1c1,GCAGTTAAGCTTGAAAGCATT,pLKO.1,1072,CDS,80,89,,,Y,124149,ANKRD26P1,CCGGGCAGTTAAGCTTGAAAGCATTCTCGAGAATGCTTTCAAGCTTAACTGCTTTTTG,AATTCAAAAAGCAGTTAAGCTTGAAAGCATTCTCGAGAATGCTTTCAAGCTTAACTGC,n/a
human,117154,DACH2,NM_001139515.1,TRCN0000138251,NM_025043.1-308s1c1,CCAAACCTCAATCCACTGGTT,pLKO.1,445,CDS,80,89,,,Y,,,CCGGCCAAACCTCAATCCACTGGTTCTCGAGAACCAGTGGATTGAGGTTTGGTTTTTG,AATTCAAAAACCAAACCTCAATCCACTGGTTCTCGAGAACCAGTGGATTGAGGTTTGG,n/a
human,117154,DACH2,NM_001139515.1,TRCN0000360357,NM_010455.2-1537s21c1,CAGTTCAGGACCCGACAGGAA,pLKO_005,81,CDS,80,89,,,Y,15404,Hoxa7,CCGGCAGTTCAGGACCCGACAGGAACTCGAGTTCCTGTCGGGTCCTGAACTGTTTTTG,AATTCAAAAACAGTTCAGGACCCGACAGGAACTCGAGTTCCTGTCGGGTCCTGAACTG,n/a
human,117154,DACH2,NM_001139515.1,TRCN0000128785,NM_022063.1-296s1c1,CAAACTCGGAAGATGAAGCTA,pLKO.1,228,CDS,81,85,,,Y,63877,FAM204A,CCGGCAAACTCGGAAGATGAAGCTACTCGAGTAGCTTCATCTTCCGAGTTTGTTTTTG,AATTCAAAAACAAACTCGGAAGATGAAGCTACTCGAGTAGCTTCATCTTCCGAGTTTG,n/a
human,117154,DACH2,NM_001139515.1,TRCN0000180576,NM_001013607.1-75s1c1,GCACAGATTCAAGTTCACGTA,pLKO.1,613,CDS,77,85,,,N,327956,Vmo1,CCGGGCACAGATTCAAGTTCACGTACTCGAGTACGTGAACTTGAATCTGTGCTTTTTG,AATTCAAAAAGCACAGATTCAAGTTCACGTACTCGAGTACGTGAACTTGAATCTGTGC,n/a
human,117154,DACH2,NM_001139515.1,TRCN0000010081,NM_001259.x-1000s1c1,GTCTCACCCATACTTCCAGGA,pLKO.1,513,CDS,77,85,,,Y,1021,CDK6,CCGGGTCTCACCCATACTTCCAGGACTCGAGTCCTGGAAGTATGGGTGAGACTTTTTG,AATTCAAAAAGTCTCACCCATACTTCCAGGACTCGAGTCCTGGAAGTATGGGTGAGAC,n/a
human,117154,DACH2,NM_001139515.1,TRCN0000026069,NM_153071.1-763s1c1,CCAGCCTTCCTCTCAGATAAT,pLKO.1,755,CDS,77,85,,,Y,210198,Gprc6a,CCGGCCAGCCTTCCTCTCAGATAATCTCGAGATTATCTGAGAGGAAGGCTGGTTTTTG,AATTCAAAAACCAGCCTTCCTCTCAGATAATCTCGAGATTATCTGAGAGGAAGGCTGG,n/a
