Taxon,"Gene ID","Gene Symbol",Transcript,"Clone ID","Legacy Clone Name","Target Seq",Vector,"Match Position","Match Region","Match %","SDR Match %","Intrinsic Score","Adjusted Score","Matches Other Gene in Same Taxon?","Orig. Target Gene ID","Orig. Target Gene Symbol","Forward Oligo Sequence","Reverse Oligo Sequence",Addgene
mouse,108699,Chn1,NM_001166604.1,TRCN0000112397,NM_175752.1-1370s1c1,GCCCTGAACGACATACGCTAT,pLKO.1,1252,CDS,100,100,4.05,5.67,N,108699,Chn1,CCGGGCCCTGAACGACATACGCTATCTCGAGATAGCGTATGTCGTTCAGGGCTTTTTG,AATTCAAAAAGCCCTGAACGACATACGCTATCTCGAGATAGCGTATGTCGTTCAGGGC,n/a
mouse,108699,Chn1,NM_001166604.1,TRCN0000112398,NM_175752.1-615s1c1,CATCACTTGTTAGAAGAGCAA,pLKO.1,671,CDS,100,100,2.64,3.696,N,108699,Chn1,CCGGCATCACTTGTTAGAAGAGCAACTCGAGTTGCTCTTCTAACAAGTGATGTTTTTG,AATTCAAAAACATCACTTGTTAGAAGAGCAACTCGAGTTGCTCTTCTAACAAGTGATG,n/a
mouse,108699,Chn1,NM_001166604.1,TRCN0000112399,NM_175752.1-1033s1c1,GAAGGCGGATATTTCTGTGAA,pLKO.1,915,CDS,100,100,4.95,3.96,N,108699,Chn1,CCGGGAAGGCGGATATTTCTGTGAACTCGAGTTCACAGAAATATCCGCCTTCTTTTTG,AATTCAAAAAGAAGGCGGATATTTCTGTGAACTCGAGTTCACAGAAATATCCGCCTTC,n/a
mouse,108699,Chn1,NM_001166604.1,TRCN0000112395,NM_175752.1-3204s1c1,GCCTAATATGTGCAAAGGATT,pLKO.1,3086,3UTR,100,100,4.95,3.465,N,108699,Chn1,CCGGGCCTAATATGTGCAAAGGATTCTCGAGAATCCTTTGCACATATTAGGCTTTTTG,AATTCAAAAAGCCTAATATGTGCAAAGGATTCTCGAGAATCCTTTGCACATATTAGGC,n/a
mouse,108699,Chn1,NM_001166604.1,TRCN0000112396,NM_175752.1-756s1c1,AGGGAGTGAAATGTGCAGATT,pLKO.1,812,CDS,90,95,,,N,108699,Chn1,CCGGAGGGAGTGAAATGTGCAGATTCTCGAGAATCTGCACATTTCACTCCCTTTTTTG,AATTCAAAAAAGGGAGTGAAATGTGCAGATTCTCGAGAATCTGCACATTTCACTCCCT,n/a
mouse,108699,Chn1,NM_001166604.1,TRCN0000047802,NM_001822.2-1209s1c1,CTGAAGGACTATACCGAGTAT,pLKO.1,839,CDS,90,95,,,Y,1123,CHN1,CCGGCTGAAGGACTATACCGAGTATCTCGAGATACTCGGTATAGTCCTTCAGTTTTTG,AATTCAAAAACTGAAGGACTATACCGAGTATCTCGAGATACTCGGTATAGTCCTTCAG,n/a
mouse,108699,Chn1,NM_001166604.1,TRCN0000333662,NM_001822.4-1426s21c1,CTGAAGGACTATACCGAGTAT,pLKO_005,839,CDS,90,95,,,Y,1123,CHN1,CCGGCTGAAGGACTATACCGAGTATCTCGAGATACTCGGTATAGTCCTTCAGTTTTTG,AATTCAAAAACTGAAGGACTATACCGAGTATCTCGAGATACTCGGTATAGTCCTTCAG,n/a
mouse,108699,Chn1,NM_001166604.1,TRCN0000238932,NM_029536.2-1530s21c1,TCCTCCACTGGCTAGCAATTA,pLKO_005,3544,3UTR,85,89,,,Y,76206,Gpr165,CCGGTCCTCCACTGGCTAGCAATTACTCGAGTAATTGCTAGCCAGTGGAGGATTTTTG,AATTCAAAAATCCTCCACTGGCTAGCAATTACTCGAGTAATTGCTAGCCAGTGGAGGA,n/a
mouse,108699,Chn1,NM_001166604.1,TRCN0000110535,NM_016794.2-460s1c1,CCTCCCTAATATGTGCCAAGA,pLKO.1,3083,3UTR,85,89,,,Y,22320,Vamp8,CCGGCCTCCCTAATATGTGCCAAGACTCGAGTCTTGGCACATATTAGGGAGGTTTTTG,AATTCAAAAACCTCCCTAATATGTGCCAAGACTCGAGTCTTGGCACATATTAGGGAGG,n/a
mouse,108699,Chn1,NM_001166604.1,TRCN0000325598,NM_016794.2-460s21c1,CCTCCCTAATATGTGCCAAGA,pLKO_005,3083,3UTR,85,89,,,Y,22320,Vamp8,CCGGCCTCCCTAATATGTGCCAAGACTCGAGTCTTGGCACATATTAGGGAGGTTTTTG,AATTCAAAAACCTCCCTAATATGTGCCAAGACTCGAGTCTTGGCACATATTAGGGAGG,n/a
mouse,108699,Chn1,NM_001166604.1,TRCN0000016700,XM_376763.1-348s1c1,GAGGACCAACTCTGAAAGAGA,pLKO.1,683,CDS,85,89,,,Y,64641,EBF2,CCGGGAGGACCAACTCTGAAAGAGACTCGAGTCTCTTTCAGAGTTGGTCCTCTTTTTG,AATTCAAAAAGAGGACCAACTCTGAAAGAGACTCGAGTCTCTTTCAGAGTTGGTCCTC,n/a
mouse,108699,Chn1,NM_001166604.1,TRCN0000006845,NM_002481.2-7473s1c1,CCGCACTTTAAGCACACACTT,pLKO.1,3164,3UTR,85,89,,,Y,4660,PPP1R12B,CCGGCCGCACTTTAAGCACACACTTCTCGAGAAGTGTGTGCTTAAAGTGCGGTTTTTG,AATTCAAAAACCGCACTTTAAGCACACACTTCTCGAGAAGTGTGTGCTTAAAGTGCGG,n/a
mouse,108699,Chn1,NM_001166604.1,TRCN0000000323,NM_018455.x-1162s1c1,ACAGTACACAAAGCCAAACCA,pLKO.1,538,CDS,85,89,,,Y,55839,CENPN,CCGGACAGTACACAAAGCCAAACCACTCGAGTGGTTTGGCTTTGTGTACTGTTTTTTG,AATTCAAAAAACAGTACACAAAGCCAAACCACTCGAGTGGTTTGGCTTTGTGTACTGT,n/a
mouse,108699,Chn1,NM_001166604.1,TRCN0000279880,NM_018455.4-1207s21c1,ACAGTACACAAAGCCAAACCA,pLKO_005,538,CDS,85,89,,,Y,55839,CENPN,CCGGACAGTACACAAAGCCAAACCACTCGAGTGGTTTGGCTTTGTGTACTGTTTTTTG,AATTCAAAAAACAGTACACAAAGCCAAACCACTCGAGTGGTTTGGCTTTGTGTACTGT,n/a
mouse,108699,Chn1,NM_001166604.1,TRCN0000357271,NM_006794.2-1789s21c1,TGGATTTGCCAATTCATATAT,pLKO_005,3610,3UTR,80,89,,,N,10936,GPR75,CCGGTGGATTTGCCAATTCATATATCTCGAGATATATGAATTGGCAAATCCATTTTTG,AATTCAAAAATGGATTTGCCAATTCATATATCTCGAGATATATGAATTGGCAAATCCA,n/a
mouse,108699,Chn1,NM_001166604.1,TRCN0000078536,NM_175061.2-698s1c1,GCACCACACAATCAATTTCCA,pLKO.1,1905,3UTR,80,89,,,Y,221895,JAZF1,CCGGGCACCACACAATCAATTTCCACTCGAGTGGAAATTGATTGTGTGGTGCTTTTTG,AATTCAAAAAGCACCACACAATCAATTTCCACTCGAGTGGAAATTGATTGTGTGGTGC,n/a
mouse,108699,Chn1,NM_001166604.1,TRCN0000264051,NM_001080446.2-82s21c1,CAGCCTCTTCCTCCACCTCAT,pLKO_005,1813,3UTR,80,89,,,Y,143678,C11orf94,CCGGCAGCCTCTTCCTCCACCTCATCTCGAGATGAGGTGGAGGAAGAGGCTGTTTTTG,AATTCAAAAACAGCCTCTTCCTCCACCTCATCTCGAGATGAGGTGGAGGAAGAGGCTG,n/a
mouse,108699,Chn1,NM_001166604.1,TRCN0000030351,NM_146901.1-560s1c1,CCTGCACAGACACACACATTT,pLKO.1,1728,3UTR,80,89,,,Y,258903,Olfr1217,CCGGCCTGCACAGACACACACATTTCTCGAGAAATGTGTGTGTCTGTGCAGGTTTTTG,AATTCAAAAACCTGCACAGACACACACATTTCTCGAGAAATGTGTGTGTCTGTGCAGG,n/a
mouse,108699,Chn1,NM_001166604.1,TRCN0000433316,NM_006158.3-1234s21c1,GTGAAGATGGCTTTGGATATT,pLKO_005,886,CDS,80,89,,,Y,4747,NEFL,CCGGGTGAAGATGGCTTTGGATATTCTCGAGAATATCCAAAGCCATCTTCACTTTTTG,AATTCAAAAAGTGAAGATGGCTTTGGATATTCTCGAGAATATCCAAAGCCATCTTCAC,n/a
mouse,108699,Chn1,NM_001166604.1,TRCN0000218636,NM_004333.4-1674s21c1,ATCACCATCTCCATATCATTG,pLKO_005,1768,3UTR,80,89,,,Y,673,BRAF,CCGGATCACCATCTCCATATCATTGCTCGAGCAATGATATGGAGATGGTGATTTTTTG,AATTCAAAAAATCACCATCTCCATATCATTGCTCGAGCAATGATATGGAGATGGTGAT,n/a
mouse,108699,Chn1,NM_001166604.1,TRCN0000197849,NM_198663.1-841s1c1,GATTTGTTTGACGAGAAGAAA,pLKO.1,1325,3UTR,86,85,,,Y,381590,C87499,CCGGGATTTGTTTGACGAGAAGAAACTCGAGTTTCTTCTCGTCAAACAAATCTTTTTG,AATTCAAAAAGATTTGTTTGACGAGAAGAAACTCGAGTTTCTTCTCGTCAAACAAATC,n/a
mouse,108699,Chn1,NM_001166604.1,TRCN0000187874,NM_146708.1-707s1c1,GCAGAAAGAAAGCTTTCTCCA,pLKO.1,106,5UTR,86,85,,,Y,258703,Olfr402,CCGGGCAGAAAGAAAGCTTTCTCCACTCGAGTGGAGAAAGCTTTCTTTCTGCTTTTTG,AATTCAAAAAGCAGAAAGAAAGCTTTCTCCACTCGAGTGGAGAAAGCTTTCTTTCTGC,n/a
mouse,108699,Chn1,NM_001166604.1,TRCN0000584701,,GGTATGTAGGCCTCTTCATTA,pLKO_005,62,5UTR,81,85,,,Y,219968,OR5B21,CCGGGGTATGTAGGCCTCTTCATTACTCGAGTAATGAAGAGGCCTACATACCTTTTTG,AATTCAAAAAGGTATGTAGGCCTCTTCATTACTCGAGTAATGAAGAGGCCTACATACC,n/a
mouse,108699,Chn1,NM_001166604.1,TRCN0000177705,NM_172496.2-2189s1c1,CCACAGTTACATCACTTGTTT,pLKO.1,661,CDS,81,85,,,Y,12808,Cobl,CCGGCCACAGTTACATCACTTGTTTCTCGAGAAACAAGTGATGTAACTGTGGTTTTTG,AATTCAAAAACCACAGTTACATCACTTGTTTCTCGAGAAACAAGTGATGTAACTGTGG,n/a
mouse,108699,Chn1,NM_001166604.1,TRCN0000137016,NM_022483.3-1092s1c1,CCTCTTGCTCAGGAAGTGTAT,pLKO.1,801,CDS,81,85,,,Y,64417,TMEM267,CCGGCCTCTTGCTCAGGAAGTGTATCTCGAGATACACTTCCTGAGCAAGAGGTTTTTG,AATTCAAAAACCTCTTGCTCAGGAAGTGTATCTCGAGATACACTTCCTGAGCAAGAGG,n/a
mouse,108699,Chn1,NM_001166604.1,TRCN0000380068,NM_017813.3-1721s21c1,GGTTGAAGGAAAGATTGATTT,pLKO_005,2890,3UTR,81,85,,,Y,54928,IMPAD1,CCGGGGTTGAAGGAAAGATTGATTTCTCGAGAAATCAATCTTTCCTTCAACCTTTTTG,AATTCAAAAAGGTTGAAGGAAAGATTGATTTCTCGAGAAATCAATCTTTCCTTCAACC,n/a
mouse,108699,Chn1,NM_001166604.1,TRCN0000203646,XM_166090.6-637s1c1,CCTTCCTTAGCTTCATGTGAA,pLKO.1,2226,3UTR,81,85,,,Y,219348,PLAC9,CCGGCCTTCCTTAGCTTCATGTGAACTCGAGTTCACATGAAGCTAAGGAAGGTTTTTG,AATTCAAAAACCTTCCTTAGCTTCATGTGAACTCGAGTTCACATGAAGCTAAGGAAGG,n/a
mouse,108699,Chn1,NM_001166604.1,TRCN0000376990,NM_172645.2-1582s21c1,GGTGGAGCTGCTATCACATTT,pLKO_005,1284,CDS,77,85,,,Y,226551,Suco,CCGGGGTGGAGCTGCTATCACATTTCTCGAGAAATGTGATAGCAGCTCCACCTTTTTG,AATTCAAAAAGGTGGAGCTGCTATCACATTTCTCGAGAAATGTGATAGCAGCTCCACC,n/a
