Taxon,"Gene ID","Gene Symbol",Transcript,"Clone ID","Legacy Clone Name","Target Seq",Vector,"Match Position","Match Region","Match %","SDR Match %","Intrinsic Score","Adjusted Score","Matches Other Gene in Same Taxon?","Orig. Target Gene ID","Orig. Target Gene Symbol","Forward Oligo Sequence","Reverse Oligo Sequence",Addgene
human,9542,NRG2,NM_001184935.1,TRCN0000058863,NM_004883.1-1064s1c1,GCCGAGACATTCGCATCAAAT,pLKO.1,1069,CDS,100,100,13.2,18.48,N,9542,NRG2,CCGGGCCGAGACATTCGCATCAAATCTCGAGATTTGATGCGAATGTCTCGGCTTTTTG,AATTCAAAAAGCCGAGACATTCGCATCAAATCTCGAGATTTGATGCGAATGTCTCGGC,n/a
human,9542,NRG2,NM_001184935.1,TRCN0000058864,NM_004883.1-2239s1c1,CGCAGCTATGACAGCTACTAT,pLKO.1,2046,CDS,100,100,5.625,7.875,N,9542,NRG2,CCGGCGCAGCTATGACAGCTACTATCTCGAGATAGTAGCTGTCATAGCTGCGTTTTTG,AATTCAAAAACGCAGCTATGACAGCTACTATCTCGAGATAGTAGCTGTCATAGCTGCG,n/a
human,9542,NRG2,NM_001184935.1,TRCN0000438742,NM_004883.1-2067s21c1,GGTGCCAACTTTCGAGATCAC,pLKO_005,1874,CDS,100,100,4.05,5.67,N,9542,NRG2,CCGGGGTGCCAACTTTCGAGATCACCTCGAGGTGATCTCGAAAGTTGGCACCTTTTTG,AATTCAAAAAGGTGCCAACTTTCGAGATCACCTCGAGGTGATCTCGAAAGTTGGCACC,n/a
human,9542,NRG2,NM_001184935.1,TRCN0000434416,NM_004883.1-1095s21c1,CAGAAAGAACTCACGACTACA,pLKO_005,1100,CDS,100,100,4.95,3.96,N,9542,NRG2,CCGGCAGAAAGAACTCACGACTACACTCGAGTGTAGTCGTGAGTTCTTTCTGTTTTTG,AATTCAAAAACAGAAAGAACTCACGACTACACTCGAGTGTAGTCGTGAGTTCTTTCTG,n/a
human,9542,NRG2,NM_001184935.1,TRCN0000455012,NM_004883.1-788s21c1,TCGAAAGGAACCAGCGCTACA,pLKO_005,793,CDS,100,100,4.05,3.24,N,9542,NRG2,CCGGTCGAAAGGAACCAGCGCTACACTCGAGTGTAGCGCTGGTTCCTTTCGATTTTTG,AATTCAAAAATCGAAAGGAACCAGCGCTACACTCGAGTGTAGCGCTGGTTCCTTTCGA,n/a
human,9542,NRG2,NM_001184935.1,TRCN0000433268,NM_004883.1-839s21c1,TAGTCTTTAAGACGGCCTTTG,pLKO_005,844,CDS,100,100,6,4.2,N,9542,NRG2,CCGGTAGTCTTTAAGACGGCCTTTGCTCGAGCAAAGGCCGTCTTAAAGACTATTTTTG,AATTCAAAAATAGTCTTTAAGACGGCCTTTGCTCGAGCAAAGGCCGTCTTAAAGACTA,n/a
human,9542,NRG2,NM_001184935.1,TRCN0000446019,NM_004883.1-972s21c1,GGGTGAGAAGCAATCGCTGAA,pLKO_005,977,CDS,100,100,4.05,2.835,N,9542,NRG2,CCGGGGGTGAGAAGCAATCGCTGAACTCGAGTTCAGCGATTGCTTCTCACCCTTTTTG,AATTCAAAAAGGGTGAGAAGCAATCGCTGAACTCGAGTTCAGCGATTGCTTCTCACCC,n/a
human,9542,NRG2,NM_001184935.1,TRCN0000058865,NM_004883.1-933s1c1,GCCCAAGTTGAAGAAGATGAA,pLKO.1,938,CDS,100,100,4.95,2.97,N,9542,NRG2,CCGGGCCCAAGTTGAAGAAGATGAACTCGAGTTCATCTTCTTCAACTTGGGCTTTTTG,AATTCAAAAAGCCCAAGTTGAAGAAGATGAACTCGAGTTCATCTTCTTCAACTTGGGC,n/a
human,9542,NRG2,NM_001184935.1,TRCN0000065362,XM_355073.2-726s1c1,CGGCTTCTCGATGCTGCTCTT,pLKO.1,527,CDS,95,95,,,N,100042150,Nrg2,CCGGCGGCTTCTCGATGCTGCTCTTCTCGAGAAGAGCAGCATCGAGAAGCCGTTTTTG,AATTCAAAAACGGCTTCTCGATGCTGCTCTTCTCGAGAAGAGCAGCATCGAGAAGCCG,n/a
human,9542,NRG2,NM_001184935.1,TRCN0000158276,NM_014483.1-282s1c1,CAGCAACAACAGCAGCAACAA,pLKO.1,380,CDS,85,95,,,Y,27303,RBMS3,CCGGCAGCAACAACAGCAGCAACAACTCGAGTTGTTGCTGCTGTTGTTGCTGTTTTTG,AATTCAAAAACAGCAACAACAGCAGCAACAACTCGAGTTGTTGCTGCTGTTGTTGCTG,n/a
human,9542,NRG2,NM_001184935.1,TRCN0000097700,NM_133769.1-3865s1c1,GCAGACCTTCAACCTGGAGGA,pLKO.1,1713,CDS,90,89,,,Y,76884,Cyfip2,CCGGGCAGACCTTCAACCTGGAGGACTCGAGTCCTCCAGGTTGAAGGTCTGCTTTTTG,AATTCAAAAAGCAGACCTTCAACCTGGAGGACTCGAGTCCTCCAGGTTGAAGGTCTGC,n/a
human,9542,NRG2,NM_001184935.1,TRCN0000085854,NM_020589.1-1128s1c1,CGAGAAACGTTTCCGCAAGAA,pLKO.1,3224,3UTR,85,89,,,N,68910,Zfp467,CCGGCGAGAAACGTTTCCGCAAGAACTCGAGTTCTTGCGGAAACGTTTCTCGTTTTTG,AATTCAAAAACGAGAAACGTTTCCGCAAGAACTCGAGTTCTTGCGGAAACGTTTCTCG,n/a
human,9542,NRG2,NM_001184935.1,TRCN0000364564,NM_014779.2-1992s21c1,AGCAGGAGCAGCAGCATAATC,pLKO_005,369,CDS,85,89,,,Y,9819,TSC22D2,CCGGAGCAGGAGCAGCAGCATAATCCTCGAGGATTATGCTGCTGCTCCTGCTTTTTTG,AATTCAAAAAAGCAGGAGCAGCAGCATAATCCTCGAGGATTATGCTGCTGCTCCTGCT,n/a
human,9542,NRG2,NM_001184935.1,TRCN0000055057,NM_007547.1-847s1c1,TGGTTCAAAGATGGGCAAGAA,pLKO.1,1038,CDS,85,89,,,Y,19261,Sirpa,CCGGTGGTTCAAAGATGGGCAAGAACTCGAGTTCTTGCCCATCTTTGAACCATTTTTG,AATTCAAAAATGGTTCAAAGATGGGCAAGAACTCGAGTTCTTGCCCATCTTTGAACCA,n/a
human,9542,NRG2,NM_001184935.1,TRCN0000040043,NM_000245.1-4571s1c1,ATCAGAACCAGAGGCTTGGTC,pLKO.1,1378,CDS,85,89,,,Y,4233,MET,CCGGATCAGAACCAGAGGCTTGGTCCTCGAGGACCAAGCCTCTGGTTCTGATTTTTTG,AATTCAAAAAATCAGAACCAGAGGCTTGGTCCTCGAGGACCAAGCCTCTGGTTCTGAT,n/a
human,9542,NRG2,NM_001184935.1,TRCN0000010379,NM_000245.x-4571s1c1,CATCAGAACCAGAGGCTTGGT,pLKO.1,1377,CDS,85,89,,,Y,4233,MET,CCGGCATCAGAACCAGAGGCTTGGTCTCGAGACCAAGCCTCTGGTTCTGATGTTTTTG,AATTCAAAAACATCAGAACCAGAGGCTTGGTCTCGAGACCAAGCCTCTGGTTCTGATG,n/a
human,9542,NRG2,NM_001184935.1,TRCN0000166517,NM_198841.1-1386s1c1,CGTTGAAGAAGACGAAGAGCT,pLKO.1,943,CDS,85,89,,,Y,158293,FAM120AOS,CCGGCGTTGAAGAAGACGAAGAGCTCTCGAGAGCTCTTCGTCTTCTTCAACGTTTTTG,AATTCAAAAACGTTGAAGAAGACGAAGAGCTCTCGAGAGCTCTTCGTCTTCTTCAACG,n/a
human,9542,NRG2,NM_001184935.1,TRCN0000200614,NM_001034900.1-330s1c1,CCTTTGCATTTCAGAGTCATA,pLKO.1,3382,3UTR,85,89,,,Y,545471,Zfp345,CCGGCCTTTGCATTTCAGAGTCATACTCGAGTATGACTCTGAAATGCAAAGGTTTTTG,AATTCAAAAACCTTTGCATTTCAGAGTCATACTCGAGTATGACTCTGAAATGCAAAGG,n/a
human,9542,NRG2,NM_001184935.1,TRCN0000254379,NM_146246.3-1478s21c1,CACAACCCAGCTATGACATAT,pLKO_005,3510,3UTR,80,89,,,N,271209,Rp1l1,CCGGCACAACCCAGCTATGACATATCTCGAGATATGTCATAGCTGGGTTGTGTTTTTG,AATTCAAAAACACAACCCAGCTATGACATATCTCGAGATATGTCATAGCTGGGTTGTG,n/a
human,9542,NRG2,NM_001184935.1,TRCN0000049156,XM_292963.3-117s1c1,GAATACTGGAGAGAAAGGATT,pLKO.1,2646,3UTR,80,89,,,Y,344178,RPL5P7,CCGGGAATACTGGAGAGAAAGGATTCTCGAGAATCCTTTCTCTCCAGTATTCTTTTTG,AATTCAAAAAGAATACTGGAGAGAAAGGATTCTCGAGAATCCTTTCTCTCCAGTATTC,n/a
human,9542,NRG2,NM_001184935.1,TRCN0000440174,NM_005985.2-242s21c1,ATGCTCATCTGGGACTCTGTC,pLKO_005,2917,3UTR,80,89,,,Y,6615,SNAI1,CCGGATGCTCATCTGGGACTCTGTCCTCGAGGACAGAGTCCCAGATGAGCATTTTTTG,AATTCAAAAAATGCTCATCTGGGACTCTGTCCTCGAGGACAGAGTCCCAGATGAGCAT,n/a
human,9542,NRG2,NM_001184935.1,TRCN0000016357,NM_177400.1-648s1c1,GAAGCAGGACTCGGACGCCGA,pLKO.1,2561,CDS,80,89,,,Y,84504,NKX6-2,CCGGGAAGCAGGACTCGGACGCCGACTCGAGTCGGCGTCCGAGTCCTGCTTCTTTTTG,AATTCAAAAAGAAGCAGGACTCGGACGCCGACTCGAGTCGGCGTCCGAGTCCTGCTTC,n/a
human,9542,NRG2,NM_001184935.1,TRCN0000158749,NM_153038.1-844s1c1,GAGAGAAAGAAGGAAAGAAAT,pLKO.1,2654,3UTR,80,89,,,Y,151278,CCDC140,CCGGGAGAGAAAGAAGGAAAGAAATCTCGAGATTTCTTTCCTTCTTTCTCTCTTTTTG,AATTCAAAAAGAGAGAAAGAAGGAAAGAAATCTCGAGATTTCTTTCCTTCTTTCTCTC,n/a
human,9542,NRG2,NM_001184935.1,TRCN0000074628,NM_005089.1-1057s1c1,GACATCTACTTGTCTCCAGAT,pLKO.1,3524,3UTR,80,89,,,Y,8233,ZRSR2,CCGGGACATCTACTTGTCTCCAGATCTCGAGATCTGGAGACAAGTAGATGTCTTTTTG,AATTCAAAAAGACATCTACTTGTCTCCAGATCTCGAGATCTGGAGACAAGTAGATGTC,n/a
human,9542,NRG2,NM_001184935.1,TRCN0000446527,NM_198447.1-365s21c1,TCCAACGGCACAAACTCAAGG,pLKO_005,876,CDS,81,85,,,Y,127845,GOLT1A,CCGGTCCAACGGCACAAACTCAAGGCTCGAGCCTTGAGTTTGTGCCGTTGGATTTTTG,AATTCAAAAATCCAACGGCACAAACTCAAGGCTCGAGCCTTGAGTTTGTGCCGTTGGA,n/a
human,9542,NRG2,NM_001184935.1,TRCN0000148056,NM_020236.2-989s1c1,GTAGTTCAACAAGTGAAGGTT,pLKO.1,1118,CDS,81,85,,,Y,65008,MRPL1,CCGGGTAGTTCAACAAGTGAAGGTTCTCGAGAACCTTCACTTGTTGAACTACTTTTTG,AATTCAAAAAGTAGTTCAACAAGTGAAGGTTCTCGAGAACCTTCACTTGTTGAACTAC,n/a
human,9542,NRG2,NM_001184935.1,TRCN0000349720,NM_020236.3-1085s21c1,GTAGTTCAACAAGTGAAGGTT,pLKO_005,1118,CDS,81,85,,,Y,65008,MRPL1,CCGGGTAGTTCAACAAGTGAAGGTTCTCGAGAACCTTCACTTGTTGAACTACTTTTTG,AATTCAAAAAGTAGTTCAACAAGTGAAGGTTCTCGAGAACCTTCACTTGTTGAACTAC,n/a
human,9542,NRG2,NM_001184935.1,TRCN0000239620,XM_001480385.1-142s21c1,CAGAACCACCTCCGCAGATAT,pLKO_005,1344,CDS,77,85,,,Y,,,CCGGCAGAACCACCTCCGCAGATATCTCGAGATATCTGCGGAGGTGGTTCTGTTTTTG,AATTCAAAAACAGAACCACCTCCGCAGATATCTCGAGATATCTGCGGAGGTGGTTCTG,n/a
human,9542,NRG2,NM_001184935.1,TRCN0000427327,NM_004355.2-501s21c1,GAGAACCTGAGACACCTTAAG,pLKO_005,1492,CDS,77,85,,,Y,972,CD74,CCGGGAGAACCTGAGACACCTTAAGCTCGAGCTTAAGGTGTCTCAGGTTCTCTTTTTG,AATTCAAAAAGAGAACCTGAGACACCTTAAGCTCGAGCTTAAGGTGTCTCAGGTTCTC,n/a
human,9542,NRG2,NM_001184935.1,TRCN0000016112,NM_004527.2-152s1c1,CCCGTTCTCCTTCCACCAGAA,pLKO.1,1525,CDS,77,85,,,Y,4222,MEOX1,CCGGCCCGTTCTCCTTCCACCAGAACTCGAGTTCTGGTGGAAGGAGAACGGGTTTTTG,AATTCAAAAACCCGTTCTCCTTCCACCAGAACTCGAGTTCTGGTGGAAGGAGAACGGG,n/a
