Taxon,"Gene ID","Gene Symbol",Transcript,"Clone ID","Legacy Clone Name","Target Seq",Vector,"Match Position","Match Region","Match %","SDR Match %","Intrinsic Score","Adjusted Score","Matches Other Gene in Same Taxon?","Orig. Target Gene ID","Orig. Target Gene Symbol","Forward Oligo Sequence","Reverse Oligo Sequence",Addgene
mouse,76626,Msi2,NM_001201341.1,TRCN0000062808,NM_138962.2-387s1c1,CCAGCAAGTGTAGATAAAGTA,pLKO.1,391,CDS,100,100,5.625,7.875,N,124540,MSI2,CCGGCCAGCAAGTGTAGATAAAGTACTCGAGTACTTTATCTACACTTGCTGGTTTTTG,AATTCAAAAACCAGCAAGTGTAGATAAAGTACTCGAGTACTTTATCTACACTTGCTGG,n/a
mouse,76626,Msi2,NM_001201341.1,TRCN0000062812,NM_138962.2-275s1c1,AGATAGCCTTAGAGACTATTT,pLKO.1,279,CDS,100,100,13.2,9.24,N,124540,MSI2,CCGGAGATAGCCTTAGAGACTATTTCTCGAGAAATAGTCTCTAAGGCTATCTTTTTTG,AATTCAAAAAAGATAGCCTTAGAGACTATTTCTCGAGAAATAGTCTCTAAGGCTATCT,n/a
mouse,76626,Msi2,NM_001201341.1,TRCN0000071977,NM_054043.2-385s1c1,CCACCATGAGTTAGATTCCAA,pLKO.1,423,CDS,100,100,3,2.1,N,76626,Msi2,CCGGCCACCATGAGTTAGATTCCAACTCGAGTTGGAATCTAACTCATGGTGGTTTTTG,AATTCAAAAACCACCATGAGTTAGATTCCAACTCGAGTTGGAATCTAACTCATGGTGG,n/a
mouse,76626,Msi2,NM_001201341.1,TRCN0000324687,NM_054043.3-385s21c1,CCACCATGAGTTAGATTCCAA,pLKO_005,423,CDS,100,100,3,2.1,N,76626,Msi2,CCGGCCACCATGAGTTAGATTCCAACTCGAGTTGGAATCTAACTCATGGTGGTTTTTG,AATTCAAAAACCACCATGAGTTAGATTCCAACTCGAGTTGGAATCTAACTCATGGTGG,n/a
mouse,76626,Msi2,NM_001201341.1,TRCN0000032088,NM_010643.1-351s1c1,CGCAACCTAAGGACAAGAGCA,pLKO.1,479,CDS,90,90,,,Y,16617,Klk1b24,CCGGCGCAACCTAAGGACAAGAGCACTCGAGTGCTCTTGTCCTTAGGTTGCGTTTTTG,AATTCAAAAACGCAACCTAAGGACAAGAGCACTCGAGTGCTCTTGTCCTTAGGTTGCG,n/a
mouse,76626,Msi2,NM_001201341.1,TRCN0000064121,NM_020466.3-213s1c1,CGAAGAGGATACAATCCGGAT,pLKO.1,721,3UTR,80,89,,,Y,57226,LYRM2,CCGGCGAAGAGGATACAATCCGGATCTCGAGATCCGGATTGTATCCTCTTCGTTTTTG,AATTCAAAAACGAAGAGGATACAATCCGGATCTCGAGATCCGGATTGTATCCTCTTCG,n/a
mouse,76626,Msi2,NM_001201341.1,TRCN0000027025,NM_080708.1-2952s1c1,CGGCCCAGAAGTGTAGATATA,pLKO.1,387,CDS,81,85,,,Y,140780,Bmp2k,CCGGCGGCCCAGAAGTGTAGATATACTCGAGTATATCTACACTTCTGGGCCGTTTTTG,AATTCAAAAACGGCCCAGAAGTGTAGATATACTCGAGTATATCTACACTTCTGGGCCG,n/a
mouse,76626,Msi2,NM_001201341.1,TRCN0000065120,NM_016040.3-772s1c1,GACAATACATTCAGCACCATT,pLKO.1,725,3UTR,81,85,,,Y,50999,TMED5,CCGGGACAATACATTCAGCACCATTCTCGAGAATGGTGCTGAATGTATTGTCTTTTTG,AATTCAAAAAGACAATACATTCAGCACCATTCTCGAGAATGGTGCTGAATGTATTGTC,n/a
