Taxon,"Gene ID","Gene Symbol",Transcript,"Clone ID","Legacy Clone Name","Target Seq",Vector,"Match Position","Match Region","Match %","SDR Match %","Intrinsic Score","Adjusted Score","Matches Other Gene in Same Taxon?","Orig. Target Gene ID","Orig. Target Gene Symbol","Forward Oligo Sequence","Reverse Oligo Sequence",Addgene
human,4336,MOBP,NM_001278323.1,TRCN0000064002,NM_006501.1-131s1c1,TCGGAAATACAGCATCTGTAA,pLKO.1,127,CDS,100,100,4.95,6.93,N,4336,MOBP,CCGGTCGGAAATACAGCATCTGTAACTCGAGTTACAGATGCTGTATTTCCGATTTTTG,AATTCAAAAATCGGAAATACAGCATCTGTAACTCGAGTTACAGATGCTGTATTTCCGA,n/a
human,4336,MOBP,NM_001278323.1,TRCN0000063999,NM_006501.1-53s1c1,CCAGAAGTACTCCGAACACTT,pLKO.1,49,CDS,100,100,4.95,3.465,N,4336,MOBP,CCGGCCAGAAGTACTCCGAACACTTCTCGAGAAGTGTTCGGAGTACTTCTGGTTTTTG,AATTCAAAAACCAGAAGTACTCCGAACACTTCTCGAGAAGTGTTCGGAGTACTTCTGG,n/a
human,4336,MOBP,NM_001278323.1,TRCN0000064000,NM_006501.1-155s1c1,CGGCTGCTTCTACCAGAAGAA,pLKO.1,151,CDS,100,100,4.95,3.465,N,4336,MOBP,CCGGCGGCTGCTTCTACCAGAAGAACTCGAGTTCTTCTGGTAGAAGCAGCCGTTTTTG,AATTCAAAAACGGCTGCTTCTACCAGAAGAACTCGAGTTCTTCTGGTAGAAGCAGCCG,n/a
human,4336,MOBP,NM_001278323.1,TRCN0000064001,NM_006501.1-535s1c1,CCGTCAAAGCTTCTAGGTTCT,pLKO.1,531,CDS,100,100,4.05,2.835,N,4336,MOBP,CCGGCCGTCAAAGCTTCTAGGTTCTCTCGAGAGAACCTAGAAGCTTTGACGGTTTTTG,AATTCAAAAACCGTCAAAGCTTCTAGGTTCTCTCGAGAGAACCTAGAAGCTTTGACGG,n/a
human,4336,MOBP,NM_001278323.1,TRCN0000063998,NM_006501.1-104s1c1,CCTCAATTCCAAGAAGGAGAT,pLKO.1,100,CDS,100,100,4.05,2.43,N,4336,MOBP,CCGGCCTCAATTCCAAGAAGGAGATCTCGAGATCTCCTTCTTGGAATTGAGGTTTTTG,AATTCAAAAACCTCAATTCCAAGAAGGAGATCTCGAGATCTCCTTCTTGGAATTGAGG,n/a
human,4336,MOBP,NM_001278323.1,TRCN0000089741,NM_008614.2-184s1c1,CCAGAAGTTCTCCGAGCACTT,pLKO.1,49,CDS,90,89,,,Y,17433,Mobp,CCGGCCAGAAGTTCTCCGAGCACTTCTCGAGAAGTGCTCGGAGAACTTCTGGTTTTTG,AATTCAAAAACCAGAAGTTCTCCGAGCACTTCTCGAGAAGTGCTCGGAGAACTTCTGG,n/a
human,4336,MOBP,NM_001278323.1,TRCN0000089739,NM_008614.2-172s1c1,GCTCTCCAAGAACCAGAAGTT,pLKO.1,37,CDS,85,89,,,Y,17433,Mobp,CCGGGCTCTCCAAGAACCAGAAGTTCTCGAGAACTTCTGGTTCTTGGAGAGCTTTTTG,AATTCAAAAAGCTCTCCAAGAACCAGAAGTTCTCGAGAACTTCTGGTTCTTGGAGAGC,n/a
human,4336,MOBP,NM_001278323.1,TRCN0000172475,NM_001010889.1-372s1c1,CTTCCTCAATGCCAAGAGGAA,pLKO.1,97,CDS,85,89,,,Y,440561,PRAMEF6,CCGGCTTCCTCAATGCCAAGAGGAACTCGAGTTCCTCTTGGCATTGAGGAAGTTTTTG,AATTCAAAAACTTCCTCAATGCCAAGAGGAACTCGAGTTCCTCTTGGCATTGAGGAAG,n/a
human,4336,MOBP,NM_001278323.1,TRCN0000296781,NM_003043.3-2189s21c1,TCCTGCTGTTTACTAACATTA,pLKO_005,604,3UTR,80,89,,,Y,6533,SLC6A6,CCGGTCCTGCTGTTTACTAACATTACTCGAGTAATGTTAGTAAACAGCAGGATTTTTG,AATTCAAAAATCCTGCTGTTTACTAACATTACTCGAGTAATGTTAGTAAACAGCAGGA,n/a
human,4336,MOBP,NM_001278323.1,TRCN0000201233,NM_008836.2-99s1c1,GAAAGACTGCATCTGTAAGTA,pLKO.1,130,CDS,80,89,,,Y,18690,Phxr5,CCGGGAAAGACTGCATCTGTAAGTACTCGAGTACTTACAGATGCAGTCTTTCTTTTTG,AATTCAAAAAGAAAGACTGCATCTGTAAGTACTCGAGTACTTACAGATGCAGTCTTTC,n/a
human,4336,MOBP,NM_001278323.1,TRCN0000089740,NM_008614.2-328s1c1,TGCCTGCCAGAAGACTAGATT,pLKO.1,193,CDS,80,89,,,Y,17433,Mobp,CCGGTGCCTGCCAGAAGACTAGATTCTCGAGAATCTAGTCTTCTGGCAGGCATTTTTG,AATTCAAAAATGCCTGCCAGAAGACTAGATTCTCGAGAATCTAGTCTTCTGGCAGGCA,n/a
