Taxon,"Gene ID","Gene Symbol",Transcript,"Clone ID","Legacy Clone Name","Target Seq",Vector,"Match Position","Match Region","Match %","SDR Match %","Intrinsic Score","Adjusted Score","Matches Other Gene in Same Taxon?","Orig. Target Gene ID","Orig. Target Gene Symbol","Forward Oligo Sequence","Reverse Oligo Sequence",Addgene
mouse,16497,Kcnab1,NM_001289450.1,TRCN0000069327,NM_010597.2-1528s1c1,CGTGGTGAACGAGATTGATAA,pLKO.1,1128,CDS,100,100,13.2,18.48,N,16497,Kcnab1,CCGGCGTGGTGAACGAGATTGATAACTCGAGTTATCAATCTCGTTCACCACGTTTTTG,AATTCAAAAACGTGGTGAACGAGATTGATAACTCGAGTTATCAATCTCGTTCACCACG,n/a
mouse,16497,Kcnab1,NM_001289450.1,TRCN0000069323,NM_010597.2-2794s1c1,GCTATCTGTAAATACGGATAA,pLKO.1,2394,3UTR,100,100,10.8,8.64,N,16497,Kcnab1,CCGGGCTATCTGTAAATACGGATAACTCGAGTTATCCGTATTTACAGATAGCTTTTTG,AATTCAAAAAGCTATCTGTAAATACGGATAACTCGAGTTATCCGTATTTACAGATAGC,n/a
mouse,16497,Kcnab1,NM_001289450.1,TRCN0000069325,NM_010597.2-1300s1c1,CCAGTGGTTGAAGGAAAGAAT,pLKO.1,900,CDS,100,100,5.625,3.375,N,16497,Kcnab1,CCGGCCAGTGGTTGAAGGAAAGAATCTCGAGATTCTTTCCTTCAACCACTGGTTTTTG,AATTCAAAAACCAGTGGTTGAAGGAAAGAATCTCGAGATTCTTTCCTTCAACCACTGG,n/a
mouse,16497,Kcnab1,NM_001289450.1,TRCN0000044792,NM_003471.2-1317s1c1,CTCCTGAACAACTCATTGAAA,pLKO.1,1067,CDS,95,95,,,N,7881,KCNAB1,CCGGCTCCTGAACAACTCATTGAAACTCGAGTTTCAATGAGTTGTTCAGGAGTTTTTG,AATTCAAAAACTCCTGAACAACTCATTGAAACTCGAGTTTCAATGAGTTGTTCAGGAG,n/a
mouse,16497,Kcnab1,NM_001289450.1,TRCN0000069326,NM_010597.2-881s1c1,CTGTCAAGAAAGCATATCATT,pLKO.1,481,CDS,95,95,,,N,16497,Kcnab1,CCGGCTGTCAAGAAAGCATATCATTCTCGAGAATGATATGCTTTCTTGACAGTTTTTG,AATTCAAAAACTGTCAAGAAAGCATATCATTCTCGAGAATGATATGCTTTCTTGACAG,n/a
mouse,16497,Kcnab1,NM_001289450.1,TRCN0000044791,NM_003471.2-1150s1c1,CCAGTGGTTGAAAGAAAGAAT,pLKO.1,900,CDS,95,95,,,Y,7881,KCNAB1,CCGGCCAGTGGTTGAAAGAAAGAATCTCGAGATTCTTTCTTTCAACCACTGGTTTTTG,AATTCAAAAACCAGTGGTTGAAAGAAAGAATCTCGAGATTCTTTCTTTCAACCACTGG,n/a
mouse,16497,Kcnab1,NM_001289450.1,TRCN0000191332,NM_207256.1-514s1c1,CAAGGAATATTGGGAAATCCT,pLKO.1,206,5UTR,85,95,,,N,100504650,A730085E03Rik,CCGGCAAGGAATATTGGGAAATCCTCTCGAGAGGATTTCCCAATATTCCTTGTTTTTG,AATTCAAAAACAAGGAATATTGGGAAATCCTCTCGAGAGGATTTCCCAATATTCCTTG,n/a
mouse,16497,Kcnab1,NM_001289450.1,TRCN0000046669,NM_002777.2-385s1c1,GAGAACAAACTGAACGACATT,pLKO.1,1612,3UTR,90,89,,,Y,5657,PRTN3,CCGGGAGAACAAACTGAACGACATTCTCGAGAATGTCGTTCAGTTTGTTCTCTTTTTG,AATTCAAAAAGAGAACAAACTGAACGACATTCTCGAGAATGTCGTTCAGTTTGTTCTC,n/a
mouse,16497,Kcnab1,NM_001289450.1,TRCN0000232054,NM_000584.2-716s21c1,CAAGAGAATATCCGAACTTTA,pLKO_005,2550,3UTR,85,89,,,N,3576,CXCL8,CCGGCAAGAGAATATCCGAACTTTACTCGAGTAAAGTTCGGATATTCTCTTGTTTTTG,AATTCAAAAACAAGAGAATATCCGAACTTTACTCGAGTAAAGTTCGGATATTCTCTTG,n/a
mouse,16497,Kcnab1,NM_001289450.1,TRCN0000197462,NM_153125.1-712s1c1,CCTAACTTCCAGGTGTTTAAA,pLKO.1,6,5UTR,85,89,,,Y,227648,Sec16a,CCGGCCTAACTTCCAGGTGTTTAAACTCGAGTTTAAACACCTGGAAGTTAGGTTTTTG,AATTCAAAAACCTAACTTCCAGGTGTTTAAACTCGAGTTTAAACACCTGGAAGTTAGG,n/a
mouse,16497,Kcnab1,NM_001289450.1,TRCN0000277109,NM_153125.2-5654s21c1,CCTAACTTCCAGGTGTTTAAA,pLKO_005,6,5UTR,85,89,,,Y,227648,Sec16a,CCGGCCTAACTTCCAGGTGTTTAAACTCGAGTTTAAACACCTGGAAGTTAGGTTTTTG,AATTCAAAAACCTAACTTCCAGGTGTTTAAACTCGAGTTTAAACACCTGGAAGTTAGG,n/a
mouse,16497,Kcnab1,NM_001289450.1,TRCN0000193821,NM_178646.2-3677s1c1,CCAGGAGATTATGACCTCATA,pLKO.1,14,5UTR,85,89,,,Y,105734,Tigd5,CCGGCCAGGAGATTATGACCTCATACTCGAGTATGAGGTCATAATCTCCTGGTTTTTG,AATTCAAAAACCAGGAGATTATGACCTCATACTCGAGTATGAGGTCATAATCTCCTGG,n/a
mouse,16497,Kcnab1,NM_001289450.1,TRCN0000146646,NM_016311.3-303s1c1,CCATGAAGAAGAAATCGTTCA,pLKO.1,584,CDS,85,89,,,Y,93974,ATP5IF1,CCGGCCATGAAGAAGAAATCGTTCACTCGAGTGAACGATTTCTTCTTCATGGTTTTTG,AATTCAAAAACCATGAAGAAGAAATCGTTCACTCGAGTGAACGATTTCTTCTTCATGG,n/a
mouse,16497,Kcnab1,NM_001289450.1,TRCN0000294781,NM_027857.3-1032s21c1,TCAACCAAGGCATGGACTTAC,pLKO_005,620,CDS,80,89,,,Y,71670,Acy3,CCGGTCAACCAAGGCATGGACTTACCTCGAGGTAAGTCCATGCCTTGGTTGATTTTTG,AATTCAAAAATCAACCAAGGCATGGACTTACCTCGAGGTAAGTCCATGCCTTGGTTGA,n/a
mouse,16497,Kcnab1,NM_001289450.1,TRCN0000034978,NM_053017.2-640s1c1,CAACTCATCGAACACCTTGTA,pLKO.1,1075,CDS,80,89,,,Y,116969,ART5,CCGGCAACTCATCGAACACCTTGTACTCGAGTACAAGGTGTTCGATGAGTTGTTTTTG,AATTCAAAAACAACTCATCGAACACCTTGTACTCGAGTACAAGGTGTTCGATGAGTTG,n/a
mouse,16497,Kcnab1,NM_001289450.1,TRCN0000163442,NM_207385.1-222s1c1,GAGAAGCTGAGACACAAAGAA,pLKO.1,458,CDS,80,89,,,Y,,,CCGGGAGAAGCTGAGACACAAAGAACTCGAGTTCTTTGTGTCTCAGCTTCTCTTTTTG,AATTCAAAAAGAGAAGCTGAGACACAAAGAACTCGAGTTCTTTGTGTCTCAGCTTCTC,n/a
mouse,16497,Kcnab1,NM_001289450.1,TRCN0000269687,NM_001048249.3-650s21c1,TGAAGGACTGAACAGGCTTTG,pLKO_005,501,CDS,80,89,,,Y,643155,SMIM15,CCGGTGAAGGACTGAACAGGCTTTGCTCGAGCAAAGCCTGTTCAGTCCTTCATTTTTG,AATTCAAAAATGAAGGACTGAACAGGCTTTGCTCGAGCAAAGCCTGTTCAGTCCTTCA,n/a
mouse,16497,Kcnab1,NM_001289450.1,TRCN0000106857,NM_170610.2-268s1c1,ACCATTTCTTCCAGAGAGATT,pLKO.1,740,CDS,80,89,,,Y,255626,H2BC1,CCGGACCATTTCTTCCAGAGAGATTCTCGAGAATCTCTCTGGAAGAAATGGTTTTTTG,AATTCAAAAAACCATTTCTTCCAGAGAGATTCTCGAGAATCTCTCTGGAAGAAATGGT,n/a
mouse,16497,Kcnab1,NM_001289450.1,TRCN0000097815,NM_028523.2-1090s1c1,CCCATATTATGAAAGCTCTTT,pLKO.1,2248,3UTR,86,85,,,Y,73379,Dcbld2,CCGGCCCATATTATGAAAGCTCTTTCTCGAGAAAGAGCTTTCATAATATGGGTTTTTG,AATTCAAAAACCCATATTATGAAAGCTCTTTCTCGAGAAAGAGCTTTCATAATATGGG,n/a
mouse,16497,Kcnab1,NM_001289450.1,TRCN0000332485,NM_028523.3-998s21c1,CCCATATTATGAAAGCTCTTT,pLKO_005,2248,3UTR,86,85,,,Y,73379,Dcbld2,CCGGCCCATATTATGAAAGCTCTTTCTCGAGAAAGAGCTTTCATAATATGGGTTTTTG,AATTCAAAAACCCATATTATGAAAGCTCTTTCTCGAGAAAGAGCTTTCATAATATGGG,n/a
mouse,16497,Kcnab1,NM_001289450.1,TRCN0000115206,NM_053245.1-504s1c1,CCTGAATAATGAAGAGAGGAT,pLKO.1,2700,3UTR,81,85,,,Y,114230,Aipl1,CCGGCCTGAATAATGAAGAGAGGATCTCGAGATCCTCTCTTCATTATTCAGGTTTTTG,AATTCAAAAACCTGAATAATGAAGAGAGGATCTCGAGATCCTCTCTTCATTATTCAGG,n/a
mouse,16497,Kcnab1,NM_001289450.1,TRCN0000225716,NM_007829.3-2048s21c1,TGTTAGGAAACAGCTATATAA,pLKO_005,1865,3UTR,81,85,,,Y,13163,Daxx,CCGGTGTTAGGAAACAGCTATATAACTCGAGTTATATAGCTGTTTCCTAACATTTTTG,AATTCAAAAATGTTAGGAAACAGCTATATAACTCGAGTTATATAGCTGTTTCCTAACA,n/a
mouse,16497,Kcnab1,NM_001289450.1,TRCN0000174592,NM_020000.1-2376s1c1,GAGTTGAGCAATGACATGATT,pLKO.1,800,CDS,81,85,,,Y,80509,Med8,CCGGGAGTTGAGCAATGACATGATTCTCGAGAATCATGTCATTGCTCAACTCTTTTTG,AATTCAAAAAGAGTTGAGCAATGACATGATTCTCGAGAATCATGTCATTGCTCAACTC,n/a
mouse,16497,Kcnab1,NM_001289450.1,TRCN0000293133,NM_020000.2-890s21c1,GAGTTGAGCAATGACATGATT,pLKO_005,800,CDS,81,85,,,Y,80509,Med8,CCGGGAGTTGAGCAATGACATGATTCTCGAGAATCATGTCATTGCTCAACTCTTTTTG,AATTCAAAAAGAGTTGAGCAATGACATGATTCTCGAGAATCATGTCATTGCTCAACTC,n/a
mouse,16497,Kcnab1,NM_001289450.1,TRCN0000082053,NM_011524.1-1748s1c1,CCCATTTATTTCCTTATCTGT,pLKO.1,1397,3UTR,77,85,,,Y,21335,Tacc3,CCGGCCCATTTATTTCCTTATCTGTCTCGAGACAGATAAGGAAATAAATGGGTTTTTG,AATTCAAAAACCCATTTATTTCCTTATCTGTCTCGAGACAGATAAGGAAATAAATGGG,n/a
mouse,16497,Kcnab1,NM_001289450.1,TRCN0000236632,XM_001718684.1-700s21c1,GGCAGTGCAGACGGCTATAAT,pLKO_005,1243,3UTR,77,85,,,Y,120364,HNRNPA1P60,CCGGGGCAGTGCAGACGGCTATAATCTCGAGATTATAGCCGTCTGCACTGCCTTTTTG,AATTCAAAAAGGCAGTGCAGACGGCTATAATCTCGAGATTATAGCCGTCTGCACTGCC,n/a
