Taxon,"Gene ID","Gene Symbol",Transcript,"Clone ID","Legacy Clone Name","Target Seq",Vector,"Match Position","Match Region","Match %","SDR Match %","Intrinsic Score","Adjusted Score","Matches Other Gene in Same Taxon?","Orig. Target Gene ID","Orig. Target Gene Symbol","Forward Oligo Sequence","Reverse Oligo Sequence",Addgene
human,8091,HMGA2,NM_001300919.1,TRCN0000352779,NM_003483.4-1037s21c1,CCAAGAGGCAGACCTAGGAAA,pLKO_005,1037,CDS,100,100,4.95,3.465,N,8091,HMGA2,CCGGCCAAGAGGCAGACCTAGGAAACTCGAGTTTCCTAGGTCTGCCTCTTGGTTTTTG,AATTCAAAAACCAAGAGGCAGACCTAGGAAACTCGAGTTTCCTAGGTCTGCCTCTTGG,n/a
human,8091,HMGA2,NM_001300919.1,TRCN0000021966,NM_003483.3-1034s1c1,AGTCCCTCTAAAGCAGCTCAA,pLKO.1,986,CDS,100,100,4.05,2.835,N,8091,HMGA2,CCGGAGTCCCTCTAAAGCAGCTCAACTCGAGTTGAGCTGCTTTAGAGGGACTTTTTTG,AATTCAAAAAAGTCCCTCTAAAGCAGCTCAACTCGAGTTGAGCTGCTTTAGAGGGACT,n/a
human,8091,HMGA2,NM_001300919.1,TRCN0000342671,NM_003483.4-986s21c1,AGTCCCTCTAAAGCAGCTCAA,pLKO_005,986,CDS,100,100,4.05,2.835,N,8091,HMGA2,CCGGAGTCCCTCTAAAGCAGCTCAACTCGAGTTGAGCTGCTTTAGAGGGACTTTTTTG,AATTCAAAAAAGTCCCTCTAAAGCAGCTCAACTCGAGTTGAGCTGCTTTAGAGGGACT,n/a
human,8091,HMGA2,NM_001300919.1,TRCN0000165534,NM_001012717.1-362s1c1,GAGACAGGGTTTCACCATGTT,pLKO.1,1200,CDS,100,100,4.95,2.475,Y,,,CCGGGAGACAGGGTTTCACCATGTTCTCGAGAACATGGTGAAACCCTGTCTCTTTTTG,AATTCAAAAAGAGACAGGGTTTCACCATGTTCTCGAGAACATGGTGAAACCCTGTCTC,n/a
human,8091,HMGA2,NM_001300919.1,TRCN0000126046,NM_178057.2-329s1c1,CCCTCTCCTAAGAGACCCAGA,pLKO.1,938,CDS,95,100,.72,.36,Y,15364,Hmga2,CCGGCCCTCTCCTAAGAGACCCAGACTCGAGTCTGGGTCTCTTAGGAGAGGGTTTTTG,AATTCAAAAACCCTCTCCTAAGAGACCCAGACTCGAGTCTGGGTCTCTTAGGAGAGGG,n/a
human,8091,HMGA2,NM_001300919.1,TRCN0000256171,NM_010441.2-1011s21c1,AGACCCAGAGGAAGACCCAAA,pLKO_005,950,CDS,95,95,,,N,15364,Hmga2,CCGGAGACCCAGAGGAAGACCCAAACTCGAGTTTGGGTCTTCCTCTGGGTCTTTTTTG,AATTCAAAAAAGACCCAGAGGAAGACCCAAACTCGAGTTTGGGTCTTCCTCTGGGTCT,n/a
human,8091,HMGA2,NM_001300919.1,TRCN0000162985,NM_207497.1-342s1c1,GAGACAAGGTTTCACCATGTT,pLKO.1,1200,CDS,95,95,,,Y,401253,LINC00336,CCGGGAGACAAGGTTTCACCATGTTCTCGAGAACATGGTGAAACCTTGTCTCTTTTTG,AATTCAAAAAGAGACAAGGTTTCACCATGTTCTCGAGAACATGGTGAAACCTTGTCTC,n/a
human,8091,HMGA2,NM_001300919.1,TRCN0000140759,NM_018265.1-3067s1c1,GCCTTTCAAAGTGCTGGGATT,pLKO.1,1269,3UTR,90,95,,,Y,55765,INAVA,CCGGGCCTTTCAAAGTGCTGGGATTCTCGAGAATCCCAGCACTTTGAAAGGCTTTTTG,AATTCAAAAAGCCTTTCAAAGTGCTGGGATTCTCGAGAATCCCAGCACTTTGAAAGGC,n/a
human,8091,HMGA2,NM_001300919.1,TRCN0000155070,NM_017873.2-2761s1c1,GCCTTTCAAAGTGCTGGGATT,pLKO.1,1269,3UTR,90,95,,,Y,140459,ASB6,CCGGGCCTTTCAAAGTGCTGGGATTCTCGAGAATCCCAGCACTTTGAAAGGCTTTTTG,AATTCAAAAAGCCTTTCAAAGTGCTGGGATTCTCGAGAATCCCAGCACTTTGAAAGGC,n/a
human,8091,HMGA2,NM_001300919.1,TRCN0000104323,NM_009076.1-351s1c1,CAGGAAGAAGCAGAAGAACAT,pLKO.1,907,CDS,81,90,,,Y,269261,Rpl12,CCGGCAGGAAGAAGCAGAAGAACATCTCGAGATGTTCTTCTGCTTCTTCCTGTTTTTG,AATTCAAAAACAGGAAGAAGCAGAAGAACATCTCGAGATGTTCTTCTGCTTCTTCCTG,n/a
human,8091,HMGA2,NM_001300919.1,TRCN0000148148,NM_152654.1-1281s1c1,GAGACAGAGTTTCACCATATT,pLKO.1,1200,CDS,90,89,,,Y,199699,DAND5,CCGGGAGACAGAGTTTCACCATATTCTCGAGAATATGGTGAAACTCTGTCTCTTTTTG,AATTCAAAAAGAGACAGAGTTTCACCATATTCTCGAGAATATGGTGAAACTCTGTCTC,n/a
human,8091,HMGA2,NM_001300919.1,TRCN0000140610,NM_025042.2-931s1c1,GCCTCTCAGGTTCAAGCAATT,pLKO.1,1102,CDS,90,89,,,Y,,,CCGGGCCTCTCAGGTTCAAGCAATTCTCGAGAATTGCTTGAACCTGAGAGGCTTTTTG,AATTCAAAAAGCCTCTCAGGTTCAAGCAATTCTCGAGAATTGCTTGAACCTGAGAGGC,n/a
human,8091,HMGA2,NM_001300919.1,TRCN0000165436,NM_001012391.1-1011s1c1,GAGAAAGGGTTTCGCCATGTT,pLKO.1,1200,CDS,90,89,,,Y,100652781,SNX29P1,CCGGGAGAAAGGGTTTCGCCATGTTCTCGAGAACATGGCGAAACCCTTTCTCTTTTTG,AATTCAAAAAGAGAAAGGGTTTCGCCATGTTCTCGAGAACATGGCGAAACCCTTTCTC,n/a
human,8091,HMGA2,NM_001300919.1,TRCN0000165026,NM_001012391.1-1008s1c1,GTAGAGAAAGGGTTTCGCCAT,pLKO.1,1197,CDS,90,89,,,Y,100652781,SNX29P1,CCGGGTAGAGAAAGGGTTTCGCCATCTCGAGATGGCGAAACCCTTTCTCTACTTTTTG,AATTCAAAAAGTAGAGAAAGGGTTTCGCCATCTCGAGATGGCGAAACCCTTTCTCTAC,n/a
human,8091,HMGA2,NM_001300919.1,TRCN0000129154,NM_017760.4-4749s1c1,GCTTCTCAAATTGCTGGGATT,pLKO.1,1269,3UTR,85,89,,,Y,54892,NCAPG2,CCGGGCTTCTCAAATTGCTGGGATTCTCGAGAATCCCAGCAATTTGAGAAGCTTTTTG,AATTCAAAAAGCTTCTCAAATTGCTGGGATTCTCGAGAATCCCAGCAATTTGAGAAGC,n/a
human,8091,HMGA2,NM_001300919.1,TRCN0000091420,NM_007599.1-1245s1c1,TCCCATCTTCAAGCAATTCTT,pLKO.1,1105,CDS,85,89,,,Y,12332,Capg,CCGGTCCCATCTTCAAGCAATTCTTCTCGAGAAGAATTGCTTGAAGATGGGATTTTTG,AATTCAAAAATCCCATCTTCAAGCAATTCTTCTCGAGAAGAATTGCTTGAAGATGGGA,n/a
human,8091,HMGA2,NM_001300919.1,TRCN0000318310,NM_007599.3-1055s21c1,TCCCATCTTCAAGCAATTCTT,pLKO_005,1105,CDS,85,89,,,Y,12332,Capg,CCGGTCCCATCTTCAAGCAATTCTTCTCGAGAAGAATTGCTTGAAGATGGGATTTTTG,AATTCAAAAATCCCATCTTCAAGCAATTCTTCTCGAGAAGAATTGCTTGAAGATGGGA,n/a
human,8091,HMGA2,NM_001300919.1,TRCN0000082468,NM_022731.2-1072s1c1,CATTTCTCTCTCTCTCTCTTT,pLKO.1,251,5UTR,85,89,,,Y,64710,NUCKS1,CCGGCATTTCTCTCTCTCTCTCTTTCTCGAGAAAGAGAGAGAGAGAGAAATGTTTTTG,AATTCAAAAACATTTCTCTCTCTCTCTCTTTCTCGAGAAAGAGAGAGAGAGAGAAATG,n/a
human,8091,HMGA2,NM_001300919.1,TRCN0000130938,NM_025061.3-1274s1c1,CCGTCTAAAGCAGCTCAATCT,pLKO.1,989,CDS,80,89,,,Y,80131,LRRC8E,CCGGCCGTCTAAAGCAGCTCAATCTCTCGAGAGATTGAGCTGCTTTAGACGGTTTTTG,AATTCAAAAACCGTCTAAAGCAGCTCAATCTCTCGAGAGATTGAGCTGCTTTAGACGG,n/a
human,8091,HMGA2,NM_001300919.1,TRCN0000241250,NM_001033159.2-964s21c1,TAGGCACATGAATAGCCATTT,pLKO_005,1716,3UTR,80,89,,,Y,71063,Zfp597,CCGGTAGGCACATGAATAGCCATTTCTCGAGAAATGGCTATTCATGTGCCTATTTTTG,AATTCAAAAATAGGCACATGAATAGCCATTTCTCGAGAAATGGCTATTCATGTGCCTA,n/a
human,8091,HMGA2,NM_001300919.1,TRCN0000247938,NM_145493.1-480s21c1,GAAGAGGAGAAGGATTCTATC,pLKO_005,323,5UTR,86,85,,,Y,225644,Cplx4,CCGGGAAGAGGAGAAGGATTCTATCCTCGAGGATAGAATCCTTCTCCTCTTCTTTTTG,AATTCAAAAAGAAGAGGAGAAGGATTCTATCCTCGAGGATAGAATCCTTCTCCTCTTC,n/a
human,8091,HMGA2,NM_001300919.1,TRCN0000282786,NM_017994.4-1133s21c1,TCAAGGGCAGACCTAGCAAAT,pLKO_005,1037,CDS,86,85,,,Y,55069,TMEM248,CCGGTCAAGGGCAGACCTAGCAAATCTCGAGATTTGCTAGGTCTGCCCTTGATTTTTG,AATTCAAAAATCAAGGGCAGACCTAGCAAATCTCGAGATTTGCTAGGTCTGCCCTTGA,n/a
human,8091,HMGA2,NM_001300919.1,TRCN0000162829,NM_207497.1-336s1c1,CTTAGTGAGACAAGGTTTCAC,pLKO.1,1193,CDS,86,85,,,Y,401253,LINC00336,CCGGCTTAGTGAGACAAGGTTTCACCTCGAGGTGAAACCTTGTCTCACTAAGTTTTTG,AATTCAAAAACTTAGTGAGACAAGGTTTCACCTCGAGGTGAAACCTTGTCTCACTAAG,n/a
human,8091,HMGA2,NM_001300919.1,TRCN0000372359,NM_002059.3-212s21c1,ATATGACACCTATCAGGAGTT,pLKO_005,1567,3UTR,81,85,,,Y,2689,GH2,CCGGATATGACACCTATCAGGAGTTCTCGAGAACTCCTGATAGGTGTCATATTTTTTG,AATTCAAAAAATATGACACCTATCAGGAGTTCTCGAGAACTCCTGATAGGTGTCATAT,n/a
human,8091,HMGA2,NM_001300919.1,TRCN0000049581,NM_014610.3-1812s1c1,GCATAACATCTATGGCCTTTA,pLKO.1,1530,3UTR,77,85,,,Y,23193,GANAB,CCGGGCATAACATCTATGGCCTTTACTCGAGTAAAGGCCATAGATGTTATGCTTTTTG,AATTCAAAAAGCATAACATCTATGGCCTTTACTCGAGTAAAGGCCATAGATGTTATGC,n/a
human,8091,HMGA2,NM_001300919.1,TRCN0000116964,NM_000501.1-1863s1c1,TGCCGCTAAAGCAGCCAAATA,pLKO.1,988,CDS,77,85,,,Y,2006,ELN,CCGGTGCCGCTAAAGCAGCCAAATACTCGAGTATTTGGCTGCTTTAGCGGCATTTTTG,AATTCAAAAATGCCGCTAAAGCAGCCAAATACTCGAGTATTTGGCTGCTTTAGCGGCA,n/a
human,8091,HMGA2,NM_001300919.1,TRCN0000008207,NM_031409.2-1271s1c1,CCTTGGTGCAAGCTCAGAATT,pLKO.1,51,5UTR,77,85,,,Y,1235,CCR6,CCGGCCTTGGTGCAAGCTCAGAATTCTCGAGAATTCTGAGCTTGCACCAAGGTTTTTG,AATTCAAAAACCTTGGTGCAAGCTCAGAATTCTCGAGAATTCTGAGCTTGCACCAAGG,n/a
human,8091,HMGA2,NM_001300919.1,TRCN0000145073,NM_182616.1-635s1c1,CAAGTGTAATTTCACTGGTGA,pLKO.1,1651,3UTR,77,85,,,Y,348110,ARPIN,CCGGCAAGTGTAATTTCACTGGTGACTCGAGTCACCAGTGAAATTACACTTGTTTTTG,AATTCAAAAACAAGTGTAATTTCACTGGTGACTCGAGTCACCAGTGAAATTACACTTG,n/a
