Taxon,"Gene ID","Gene Symbol",Transcript,"Clone ID","Legacy Clone Name","Target Seq",Vector,"Match Position","Match Region","Match %","SDR Match %","Intrinsic Score","Adjusted Score","Matches Other Gene in Same Taxon?","Orig. Target Gene ID","Orig. Target Gene Symbol","Forward Oligo Sequence","Reverse Oligo Sequence",Addgene
mouse,11690,Alox5ap,NM_001308462.1,TRCN0000076455,NM_009663.1-148s1c1,GCATGAAAGCAAGGCGCATAA,pLKO.1,202,CDS,100,100,10.8,15.12,N,11690,Alox5ap,CCGGGCATGAAAGCAAGGCGCATAACTCGAGTTATGCGCCTTGCTTTCATGCTTTTTG,AATTCAAAAAGCATGAAAGCAAGGCGCATAACTCGAGTTATGCGCCTTGCTTTCATGC,n/a
mouse,11690,Alox5ap,NM_001308462.1,TRCN0000076456,NM_009663.1-472s1c1,CGGAAGCGACTTTGAGAACTA,pLKO.1,455,CDS,100,100,4.95,3.465,N,11690,Alox5ap,CCGGCGGAAGCGACTTTGAGAACTACTCGAGTAGTTCTCAAAGTCGCTTCCGTTTTTG,AATTCAAAAACGGAAGCGACTTTGAGAACTACTCGAGTAGTTCTCAAAGTCGCTTCCG,n/a
mouse,11690,Alox5ap,NM_001308462.1,TRCN0000076454,NM_009663.1-311s1c1,GCCGGACTGATGTACCTGTTT,pLKO.1,294,CDS,100,100,4.95,3.465,N,11690,Alox5ap,CCGGGCCGGACTGATGTACCTGTTTCTCGAGAAACAGGTACATCAGTCCGGCTTTTTG,AATTCAAAAAGCCGGACTGATGTACCTGTTTCTCGAGAAACAGGTACATCAGTCCGGC,n/a
mouse,11690,Alox5ap,NM_001308462.1,TRCN0000076453,NM_009663.1-614s1c1,GCTCCTCTTCAAGCTGTAGAT,pLKO.1,597,3UTR,100,100,4.95,3.465,N,11690,Alox5ap,CCGGGCTCCTCTTCAAGCTGTAGATCTCGAGATCTACAGCTTGAAGAGGAGCTTTTTG,AATTCAAAAAGCTCCTCTTCAAGCTGTAGATCTCGAGATCTACAGCTTGAAGAGGAGC,n/a
mouse,11690,Alox5ap,NM_001308462.1,TRCN0000076457,NM_009663.1-321s1c1,TGTACCTGTTTGTGAGGCAAA,pLKO.1,304,CDS,100,100,4.05,2.835,N,11690,Alox5ap,CCGGTGTACCTGTTTGTGAGGCAAACTCGAGTTTGCCTCACAAACAGGTACATTTTTG,AATTCAAAAATGTACCTGTTTGTGAGGCAAACTCGAGTTTGCCTCACAAACAGGTACA,n/a
mouse,11690,Alox5ap,NM_001308462.1,TRCN0000078149,NM_001629.2-330s1c1,GCTGGACTGATGTACTTGTTT,pLKO.1,294,CDS,90,89,,,N,241,ALOX5AP,CCGGGCTGGACTGATGTACTTGTTTCTCGAGAAACAAGTACATCAGTCCAGCTTTTTG,AATTCAAAAAGCTGGACTGATGTACTTGTTTCTCGAGAAACAAGTACATCAGTCCAGC,n/a
mouse,11690,Alox5ap,NM_001308462.1,TRCN0000379414,NM_019519.2-972s21c1,GGTGCAGAATGCCTTCTTTAC,pLKO_005,169,CDS,85,89,,,Y,56187,Rabggta,CCGGGGTGCAGAATGCCTTCTTTACCTCGAGGTAAAGAAGGCATTCTGCACCTTTTTG,AATTCAAAAAGGTGCAGAATGCCTTCTTTACCTCGAGGTAAAGAAGGCATTCTGCACC,n/a
mouse,11690,Alox5ap,NM_001308462.1,TRCN0000122112,NM_133448.1-649s1c1,CCCAGGATTTAATGCTACCTT,pLKO.1,722,3UTR,81,85,,,N,121256,TMEM132D,CCGGCCCAGGATTTAATGCTACCTTCTCGAGAAGGTAGCATTAAATCCTGGGTTTTTG,AATTCAAAAACCCAGGATTTAATGCTACCTTCTCGAGAAGGTAGCATTAAATCCTGGG,n/a
mouse,11690,Alox5ap,NM_001308462.1,TRCN0000015473,NM_020813.1-378s1c1,GCCCATTCTCAGATTGGGAAT,pLKO.1,838,3UTR,77,85,,,Y,57573,ZNF471,CCGGGCCCATTCTCAGATTGGGAATCTCGAGATTCCCAATCTGAGAATGGGCTTTTTG,AATTCAAAAAGCCCATTCTCAGATTGGGAATCTCGAGATTCCCAATCTGAGAATGGGC,n/a
mouse,11690,Alox5ap,NM_001308462.1,TRCN0000157455,NM_017888.2-594s1c1,GACAGAGAAGGACCTCAAGTA,pLKO.1,533,3UTR,77,85,,,Y,54988,ACSM5,CCGGGACAGAGAAGGACCTCAAGTACTCGAGTACTTGAGGTCCTTCTCTGTCTTTTTG,AATTCAAAAAGACAGAGAAGGACCTCAAGTACTCGAGTACTTGAGGTCCTTCTCTGTC,n/a
