Taxon,"Gene ID","Gene Symbol",Transcript,"Clone ID","Legacy Clone Name","Target Seq",Vector,"Match Position","Match Region","Match %","SDR Match %","Intrinsic Score","Adjusted Score","Matches Other Gene in Same Taxon?","Orig. Target Gene ID","Orig. Target Gene Symbol","Forward Oligo Sequence","Reverse Oligo Sequence",Addgene
human,128989,TANGO2,NM_001322167.1,TRCN0000437386,NM_152906.4-1145s21c1,GGTTTGCGTGTTACCCATCTG,pLKO_005,1011,3UTR,100,100,4.05,3.24,N,128989,TANGO2,CCGGGGTTTGCGTGTTACCCATCTGCTCGAGCAGATGGGTAACACGCAAACCTTTTTG,AATTCAAAAAGGTTTGCGTGTTACCCATCTGCTCGAGCAGATGGGTAACACGCAAACC,n/a
human,128989,TANGO2,NM_001322167.1,TRCN0000413591,NM_152906.4-1178s21c1,CAGTTCAGGGTCTGCCTTTAT,pLKO_005,1044,3UTR,100,100,13.2,9.24,N,128989,TANGO2,CCGGCAGTTCAGGGTCTGCCTTTATCTCGAGATAAAGGCAGACCCTGAACTGTTTTTG,AATTCAAAAACAGTTCAGGGTCTGCCTTTATCTCGAGATAAAGGCAGACCCTGAACTG,n/a
human,128989,TANGO2,NM_001322167.1,TRCN0000432420,NM_152906.4-931s21c1,CTTCACTGAGCGTAGCATGAT,pLKO_005,797,CDS,100,100,4.95,3.465,N,128989,TANGO2,CCGGCTTCACTGAGCGTAGCATGATCTCGAGATCATGCTACGCTCAGTGAAGTTTTTG,AATTCAAAAACTTCACTGAGCGTAGCATGATCTCGAGATCATGCTACGCTCAGTGAAG,n/a
human,128989,TANGO2,NM_001322167.1,TRCN0000130981,NM_152906.2-1811s1c1,CCTCCTGATTAGCTGGGATTA,pLKO.1,1674,3UTR,100,100,10.8,5.4,Y,128989,TANGO2,CCGGCCTCCTGATTAGCTGGGATTACTCGAGTAATCCCAGCTAATCAGGAGGTTTTTG,AATTCAAAAACCTCCTGATTAGCTGGGATTACTCGAGTAATCCCAGCTAATCAGGAGG,n/a
human,128989,TANGO2,NM_001322167.1,TRCN0000148576,NM_152906.2-759s1c1,CCTGGATGTGCTCAACAATAA,pLKO.1,623,CDS,95,100,13.2,9.24,N,128989,TANGO2,CCGGCCTGGATGTGCTCAACAATAACTCGAGTTATTGTTGAGCACATCCAGGTTTTTG,AATTCAAAAACCTGGATGTGCTCAACAATAACTCGAGTTATTGTTGAGCACATCCAGG,n/a
human,128989,TANGO2,NM_001322167.1,TRCN0000155836,NM_198582.1-3275s1c1,CCCAAAGTGCTGGGATTACAA,pLKO.1,1810,3UTR,95,100,5.625,2.8125,Y,377007,KLHL30,CCGGCCCAAAGTGCTGGGATTACAACTCGAGTTGTAATCCCAGCACTTTGGGTTTTTG,AATTCAAAAACCCAAAGTGCTGGGATTACAACTCGAGTTGTAATCCCAGCACTTTGGG,n/a
human,128989,TANGO2,NM_001322167.1,TRCN0000141025,NM_152361.1-835s1c1,CCCAAAGTGCTGGGATTACTT,pLKO.1,1810,3UTR,90,100,5.625,2.8125,Y,126272,EID2B,CCGGCCCAAAGTGCTGGGATTACTTCTCGAGAAGTAATCCCAGCACTTTGGGTTTTTG,AATTCAAAAACCCAAAGTGCTGGGATTACTTCTCGAGAAGTAATCCCAGCACTTTGGG,n/a
human,128989,TANGO2,NM_001322167.1,TRCN0000129777,NM_152906.2-760s1c1,CTGGATGTGCTCAACAATAAA,pLKO.1,624,CDS,95,95,,,N,128989,TANGO2,CCGGCTGGATGTGCTCAACAATAAACTCGAGTTTATTGTTGAGCACATCCAGTTTTTG,AATTCAAAAACTGGATGTGCTCAACAATAAACTCGAGTTTATTGTTGAGCACATCCAG,n/a
human,128989,TANGO2,NM_001322167.1,TRCN0000412785,NM_003212.2-1256s21c1,GTCACCATGCCCAGCTAATTT,pLKO_005,1704,3UTR,95,95,,,Y,6997,TDGF1,CCGGGTCACCATGCCCAGCTAATTTCTCGAGAAATTAGCTGGGCATGGTGACTTTTTG,AATTCAAAAAGTCACCATGCCCAGCTAATTTCTCGAGAAATTAGCTGGGCATGGTGAC,n/a
human,128989,TANGO2,NM_001322167.1,TRCN0000146346,NM_004666.1-2046s1c1,CCTCAGAATGTGACTGTATTT,pLKO.1,3226,3UTR,95,95,,,Y,8876,VNN1,CCGGCCTCAGAATGTGACTGTATTTCTCGAGAAATACAGTCACATTCTGAGGTTTTTG,AATTCAAAAACCTCAGAATGTGACTGTATTTCTCGAGAAATACAGTCACATTCTGAGG,n/a
human,128989,TANGO2,NM_001322167.1,TRCN0000204533,NM_001013675.1-1987s1c1,CCTCCCAAAGTGCTGGAATTA,pLKO.1,1807,3UTR,95,95,,,Y,400891,LRRC74B,CCGGCCTCCCAAAGTGCTGGAATTACTCGAGTAATTCCAGCACTTTGGGAGGTTTTTG,AATTCAAAAACCTCCCAAAGTGCTGGAATTACTCGAGTAATTCCAGCACTTTGGGAGG,n/a
human,128989,TANGO2,NM_001322167.1,TRCN0000072628,NM_016065.3-1636s1c1,CCTCCCAAAGTGCTAGGATTA,pLKO.1,1807,3UTR,95,95,,,Y,51021,MRPS16,CCGGCCTCCCAAAGTGCTAGGATTACTCGAGTAATCCTAGCACTTTGGGAGGTTTTTG,AATTCAAAAACCTCCCAAAGTGCTAGGATTACTCGAGTAATCCTAGCACTTTGGGAGG,n/a
human,128989,TANGO2,NM_001322167.1,TRCN0000139826,NM_133477.1-4628s1c1,CCTCCTGAATAGCTGGGATTA,pLKO.1,1674,3UTR,95,95,,,Y,171024,SYNPO2,CCGGCCTCCTGAATAGCTGGGATTACTCGAGTAATCCCAGCTATTCAGGAGGTTTTTG,AATTCAAAAACCTCCTGAATAGCTGGGATTACTCGAGTAATCCCAGCTATTCAGGAGG,n/a
human,128989,TANGO2,NM_001322167.1,TRCN0000165534,NM_001012717.1-362s1c1,GAGACAGGGTTTCACCATGTT,pLKO.1,1739,3UTR,95,95,,,Y,,,CCGGGAGACAGGGTTTCACCATGTTCTCGAGAACATGGTGAAACCCTGTCTCTTTTTG,AATTCAAAAAGAGACAGGGTTTCACCATGTTCTCGAGAACATGGTGAAACCCTGTCTC,n/a
human,128989,TANGO2,NM_001322167.1,TRCN0000164801,NM_016534.2-1646s1c1,CCTCCCAAAGTACTGGGATTA,pLKO.1,1807,3UTR,95,95,,,Y,51275,MAPKAPK5-AS1,CCGGCCTCCCAAAGTACTGGGATTACTCGAGTAATCCCAGTACTTTGGGAGGTTTTTG,AATTCAAAAACCTCCCAAAGTACTGGGATTACTCGAGTAATCCCAGTACTTTGGGAGG,n/a
human,128989,TANGO2,NM_001322167.1,TRCN0000008902,NM_016540.2-2291s1c1,CCTCCCAAAGTGTTGGGATTA,pLKO.1,1807,3UTR,95,95,,,Y,10888,GPR83,CCGGCCTCCCAAAGTGTTGGGATTACTCGAGTAATCCCAACACTTTGGGAGGTTTTTG,AATTCAAAAACCTCCCAAAGTGTTGGGATTACTCGAGTAATCCCAACACTTTGGGAGG,n/a
human,128989,TANGO2,NM_001322167.1,TRCN0000156315,NM_020702.1-3633s1c1,CCTCCCAAAGTGTTGGGATTA,pLKO.1,1807,3UTR,95,95,,,Y,57462,MYORG,CCGGCCTCCCAAAGTGTTGGGATTACTCGAGTAATCCCAACACTTTGGGAGGTTTTTG,AATTCAAAAACCTCCCAAAGTGTTGGGATTACTCGAGTAATCCCAACACTTTGGGAGG,n/a
human,128989,TANGO2,NM_001322167.1,TRCN0000116227,NM_024930.1-2895s1c1,CCTCCCAAAGTTCTGGGATTA,pLKO.1,1807,3UTR,95,95,,,Y,79993,ELOVL7,CCGGCCTCCCAAAGTTCTGGGATTACTCGAGTAATCCCAGAACTTTGGGAGGTTTTTG,AATTCAAAAACCTCCCAAAGTTCTGGGATTACTCGAGTAATCCCAGAACTTTGGGAGG,n/a
human,128989,TANGO2,NM_001322167.1,TRCN0000164591,NM_003281.3-2102s1c1,CCTCCCAAAGTTCTGGGATTA,pLKO.1,1807,3UTR,95,95,,,Y,7135,TNNI1,CCGGCCTCCCAAAGTTCTGGGATTACTCGAGTAATCCCAGAACTTTGGGAGGTTTTTG,AATTCAAAAACCTCCCAAAGTTCTGGGATTACTCGAGTAATCCCAGAACTTTGGGAGG,n/a
human,128989,TANGO2,NM_001322167.1,TRCN0000040213,NM_000618.2-6169s1c1,CCTCCCAAATTGCTGGGATTA,pLKO.1,1807,3UTR,95,95,,,Y,3479,IGF1,CCGGCCTCCCAAATTGCTGGGATTACTCGAGTAATCCCAGCAATTTGGGAGGTTTTTG,AATTCAAAAACCTCCCAAATTGCTGGGATTACTCGAGTAATCCCAGCAATTTGGGAGG,n/a
human,128989,TANGO2,NM_001322167.1,TRCN0000162795,NM_017842.1-1079s1c1,CTTCCAAAGTGCTGGGATTAT,pLKO.1,1808,3UTR,90,95,,,Y,55652,SLC48A1,CCGGCTTCCAAAGTGCTGGGATTATCTCGAGATAATCCCAGCACTTTGGAAGTTTTTG,AATTCAAAAACTTCCAAAGTGCTGGGATTATCTCGAGATAATCCCAGCACTTTGGAAG,n/a
human,128989,TANGO2,NM_001322167.1,TRCN0000140657,NM_012099.1-2957s1c1,CCTCCCAAAGTGCTAGGATAA,pLKO.1,1807,3UTR,90,95,,,Y,10849,CD3EAP,CCGGCCTCCCAAAGTGCTAGGATAACTCGAGTTATCCTAGCACTTTGGGAGGTTTTTG,AATTCAAAAACCTCCCAAAGTGCTAGGATAACTCGAGTTATCCTAGCACTTTGGGAGG,n/a
human,128989,TANGO2,NM_001322167.1,TRCN0000157407,NM_001003795.1-3187s1c1,GATCTCGGCTTACTGCAACTT,pLKO.1,1618,3UTR,90,95,,,Y,389524,GTF2IRD2B,CCGGGATCTCGGCTTACTGCAACTTCTCGAGAAGTTGCAGTAAGCCGAGATCTTTTTG,AATTCAAAAAGATCTCGGCTTACTGCAACTTCTCGAGAAGTTGCAGTAAGCCGAGATC,n/a
human,128989,TANGO2,NM_001322167.1,TRCN0000172742,NM_173580.1-340s1c1,GAGACAGAGTCTTGCTCTGTT,pLKO.1,1573,3UTR,90,95,,,Y,283171,C11orf44,CCGGGAGACAGAGTCTTGCTCTGTTCTCGAGAACAGAGCAAGACTCTGTCTCTTTTTG,AATTCAAAAAGAGACAGAGTCTTGCTCTGTTCTCGAGAACAGAGCAAGACTCTGTCTC,n/a
human,128989,TANGO2,NM_001322167.1,TRCN0000021570,NM_198452.1-352s1c1,CGAGAGCCCTTCCCACCTCTA,pLKO.1,2214,3UTR,85,95,,,Y,139728,PNCK,CCGGCGAGAGCCCTTCCCACCTCTACTCGAGTAGAGGTGGGAAGGGCTCTCGTTTTTG,AATTCAAAAACGAGAGCCCTTCCCACCTCTACTCGAGTAGAGGTGGGAAGGGCTCTCG,n/a
human,128989,TANGO2,NM_001322167.1,TRCN0000047783,NM_017516.1-1624s1c1,GCCTCCAAAGTGCTGGAATTA,pLKO.1,1806,3UTR,90,90,,,Y,54734,RAB39A,CCGGGCCTCCAAAGTGCTGGAATTACTCGAGTAATTCCAGCACTTTGGAGGCTTTTTG,AATTCAAAAAGCCTCCAAAGTGCTGGAATTACTCGAGTAATTCCAGCACTTTGGAGGC,n/a
human,128989,TANGO2,NM_001322167.1,TRCN0000198922,NM_178897.2-2085s1c1,GCTTCCCAAATGCTGGGATTA,pLKO.1,1806,3UTR,90,90,,,Y,100929,Tyw1,CCGGGCTTCCCAAATGCTGGGATTACTCGAGTAATCCCAGCATTTGGGAAGCTTTTTG,AATTCAAAAAGCTTCCCAAATGCTGGGATTACTCGAGTAATCCCAGCATTTGGGAAGC,n/a
human,128989,TANGO2,NM_001322167.1,TRCN0000421236,NM_024836.1-1313s21c1,GTGCTTTGGCAAGAGCTCTAC,pLKO_005,545,CDS,86,90,,,Y,79894,ZNF672,CCGGGTGCTTTGGCAAGAGCTCTACCTCGAGGTAGAGCTCTTGCCAAAGCACTTTTTG,AATTCAAAAAGTGCTTTGGCAAGAGCTCTACCTCGAGGTAGAGCTCTTGCCAAAGCAC,n/a
human,128989,TANGO2,NM_001322167.1,TRCN0000091448,NM_013513.1-2495s1c1,CCTCCCAAGTACTGGGATTAA,pLKO.1,1807,3UTR,86,90,,,Y,13828,Epb42,CCGGCCTCCCAAGTACTGGGATTAACTCGAGTTAATCCCAGTACTTGGGAGGTTTTTG,AATTCAAAAACCTCCCAAGTACTGGGATTAACTCGAGTTAATCCCAGTACTTGGGAGG,n/a
human,128989,TANGO2,NM_001322167.1,TRCN0000093417,NM_021791.2-532s1c1,CTCTCACCTATCATGGCTTTA,pLKO.1,1352,3UTR,81,90,,,N,60425,Doc2g,CCGGCTCTCACCTATCATGGCTTTACTCGAGTAAAGCCATGATAGGTGAGAGTTTTTG,AATTCAAAAACTCTCACCTATCATGGCTTTACTCGAGTAAAGCCATGATAGGTGAGAG,n/a
human,128989,TANGO2,NM_001322167.1,TRCN0000197364,XM_294316.3-781s1c2,CCCAAGTCAAGCCATTCTCAA,pLKO.1,1645,3UTR,81,90,,,Y,346525,OR2A12,CCGGCCCAAGTCAAGCCATTCTCAACTCGAGTTGAGAATGGCTTGACTTGGGTTTTTG,AATTCAAAAACCCAAGTCAAGCCATTCTCAACTCGAGTTGAGAATGGCTTGACTTGGG,n/a
human,128989,TANGO2,NM_001322167.1,TRCN0000072463,NM_001001563.1-2222s1c1,GCTACCATACCCAGCTAATTT,pLKO.1,1704,3UTR,90,89,,,Y,92609,TIMM50,CCGGGCTACCATACCCAGCTAATTTCTCGAGAAATTAGCTGGGTATGGTAGCTTTTTG,AATTCAAAAAGCTACCATACCCAGCTAATTTCTCGAGAAATTAGCTGGGTATGGTAGC,n/a
human,128989,TANGO2,NM_001322167.1,TRCN0000078633,NM_032214.2-1896s1c1,CCTCCAGAATAGCTGGGATTA,pLKO.1,1674,3UTR,90,89,,,Y,84174,SLA2,CCGGCCTCCAGAATAGCTGGGATTACTCGAGTAATCCCAGCTATTCTGGAGGTTTTTG,AATTCAAAAACCTCCAGAATAGCTGGGATTACTCGAGTAATCCCAGCTATTCTGGAGG,n/a
human,128989,TANGO2,NM_001322167.1,TRCN0000140610,NM_025042.2-931s1c1,GCCTCTCAGGTTCAAGCAATT,pLKO.1,1641,3UTR,90,89,,,Y,,,CCGGGCCTCTCAGGTTCAAGCAATTCTCGAGAATTGCTTGAACCTGAGAGGCTTTTTG,AATTCAAAAAGCCTCTCAGGTTCAAGCAATTCTCGAGAATTGCTTGAACCTGAGAGGC,n/a
human,128989,TANGO2,NM_001322167.1,TRCN0000430981,NM_173537.2-3266s21c1,GCCACCATGCCTGGCTAATTT,pLKO_005,1704,3UTR,90,89,,,Y,84163,GTF2IRD2,CCGGGCCACCATGCCTGGCTAATTTCTCGAGAAATTAGCCAGGCATGGTGGCTTTTTG,AATTCAAAAAGCCACCATGCCTGGCTAATTTCTCGAGAAATTAGCCAGGCATGGTGGC,n/a
human,128989,TANGO2,NM_001322167.1,TRCN0000063698,NM_006989.3-4525s1c1,GCCCAGCTAATTCTTGTATTT,pLKO.1,1712,3UTR,90,89,,,Y,10156,RASA4,CCGGGCCCAGCTAATTCTTGTATTTCTCGAGAAATACAAGAATTAGCTGGGCTTTTTG,AATTCAAAAAGCCCAGCTAATTCTTGTATTTCTCGAGAAATACAAGAATTAGCTGGGC,n/a
human,128989,TANGO2,NM_001322167.1,TRCN0000150276,NM_144718.2-3773s1c1,GCCCAGCTAATTTGTGTATTT,pLKO.1,1712,3UTR,90,89,,,Y,152185,SPICE1,CCGGGCCCAGCTAATTTGTGTATTTCTCGAGAAATACACAAATTAGCTGGGCTTTTTG,AATTCAAAAAGCCCAGCTAATTTGTGTATTTCTCGAGAAATACACAAATTAGCTGGGC,n/a
human,128989,TANGO2,NM_001322167.1,TRCN0000042823,NM_024055.2-973s1c1,CCTCACAAAGTGCTAGGATTA,pLKO.1,1807,3UTR,90,89,,,Y,64924,SLC30A5,CCGGCCTCACAAAGTGCTAGGATTACTCGAGTAATCCTAGCACTTTGTGAGGTTTTTG,AATTCAAAAACCTCACAAAGTGCTAGGATTACTCGAGTAATCCTAGCACTTTGTGAGG,n/a
human,128989,TANGO2,NM_001322167.1,TRCN0000082462,XM_371492.2-638s1c1,CCTCCCAAAGTGCCAGGATTA,pLKO.1,1807,3UTR,90,89,,,Y,388949,LOC388949,CCGGCCTCCCAAAGTGCCAGGATTACTCGAGTAATCCTGGCACTTTGGGAGGTTTTTG,AATTCAAAAACCTCCCAAAGTGCCAGGATTACTCGAGTAATCCTGGCACTTTGGGAGG,n/a
human,128989,TANGO2,NM_001322167.1,TRCN0000165736,NM_175901.3-1946s1c1,CCTCCCTAAGTGTTGGGATTA,pLKO.1,1807,3UTR,90,89,,,Y,283932,FBXL19-AS1,CCGGCCTCCCTAAGTGTTGGGATTACTCGAGTAATCCCAACACTTAGGGAGGTTTTTG,AATTCAAAAACCTCCCTAAGTGTTGGGATTACTCGAGTAATCCCAACACTTAGGGAGG,n/a
human,128989,TANGO2,NM_001322167.1,TRCN0000166560,NM_207497.1-412s1c1,CCTCCGAAAGTGCTAGGATTA,pLKO.1,1807,3UTR,90,89,,,Y,401253,LINC00336,CCGGCCTCCGAAAGTGCTAGGATTACTCGAGTAATCCTAGCACTTTCGGAGGTTTTTG,AATTCAAAAACCTCCGAAAGTGCTAGGATTACTCGAGTAATCCTAGCACTTTCGGAGG,n/a
human,128989,TANGO2,NM_001322167.1,TRCN0000164091,NM_024795.1-1273s1c1,CCTCCTAAAGTGCTGCGATTA,pLKO.1,1807,3UTR,90,89,,,Y,79853,TM4SF20,CCGGCCTCCTAAAGTGCTGCGATTACTCGAGTAATCGCAGCACTTTAGGAGGTTTTTG,AATTCAAAAACCTCCTAAAGTGCTGCGATTACTCGAGTAATCGCAGCACTTTAGGAGG,n/a
human,128989,TANGO2,NM_001322167.1,TRCN0000165774,NM_001012391.1-946s1c1,CCTCCTAAGTAGCTGGGATTA,pLKO.1,1674,3UTR,90,89,,,Y,100652781,SNX29P1,CCGGCCTCCTAAGTAGCTGGGATTACTCGAGTAATCCCAGCTACTTAGGAGGTTTTTG,AATTCAAAAACCTCCTAAGTAGCTGGGATTACTCGAGTAATCCCAGCTACTTAGGAGG,n/a
human,128989,TANGO2,NM_001322167.1,TRCN0000139201,NM_032120.1-1391s1c1,CCTCCTGAGTATCTGGGATTA,pLKO.1,1674,3UTR,90,89,,,Y,84060,RBM48,CCGGCCTCCTGAGTATCTGGGATTACTCGAGTAATCCCAGATACTCAGGAGGTTTTTG,AATTCAAAAACCTCCTGAGTATCTGGGATTACTCGAGTAATCCCAGATACTCAGGAGG,n/a
human,128989,TANGO2,NM_001322167.1,TRCN0000156198,NM_004927.2-974s1c1,CCTCTTGAGTAGCTGGGATTA,pLKO.1,1674,3UTR,90,89,,,Y,740,MRPL49,CCGGCCTCTTGAGTAGCTGGGATTACTCGAGTAATCCCAGCTACTCAAGAGGTTTTTG,AATTCAAAAACCTCTTGAGTAGCTGGGATTACTCGAGTAATCCCAGCTACTCAAGAGG,n/a
human,128989,TANGO2,NM_001322167.1,TRCN0000276507,NM_004927.2-974s21c1,CCTCTTGAGTAGCTGGGATTA,pLKO_005,1674,3UTR,90,89,,,Y,740,MRPL49,CCGGCCTCTTGAGTAGCTGGGATTACTCGAGTAATCCCAGCTACTCAAGAGGTTTTTG,AATTCAAAAACCTCTTGAGTAGCTGGGATTACTCGAGTAATCCCAGCTACTCAAGAGG,n/a
human,128989,TANGO2,NM_001322167.1,TRCN0000139739,NM_018265.1-2935s1c1,CCTTCTGAGTAGCTGGGATTA,pLKO.1,1674,3UTR,90,89,,,Y,55765,INAVA,CCGGCCTTCTGAGTAGCTGGGATTACTCGAGTAATCCCAGCTACTCAGAAGGTTTTTG,AATTCAAAAACCTTCTGAGTAGCTGGGATTACTCGAGTAATCCCAGCTACTCAGAAGG,n/a
human,128989,TANGO2,NM_001322167.1,TRCN0000162985,NM_207497.1-342s1c1,GAGACAAGGTTTCACCATGTT,pLKO.1,1739,3UTR,90,89,,,Y,401253,LINC00336,CCGGGAGACAAGGTTTCACCATGTTCTCGAGAACATGGTGAAACCTTGTCTCTTTTTG,AATTCAAAAAGAGACAAGGTTTCACCATGTTCTCGAGAACATGGTGAAACCTTGTCTC,n/a
human,128989,TANGO2,NM_001322167.1,TRCN0000155187,NM_001003795.1-3305s1c1,GAGATGAGGTTTCACCATGTT,pLKO.1,1739,3UTR,90,89,,,Y,389524,GTF2IRD2B,CCGGGAGATGAGGTTTCACCATGTTCTCGAGAACATGGTGAAACCTCATCTCTTTTTG,AATTCAAAAAGAGATGAGGTTTCACCATGTTCTCGAGAACATGGTGAAACCTCATCTC,n/a
human,128989,TANGO2,NM_001322167.1,TRCN0000168774,NM_001013670.1-1394s1c1,GAGATGGAGTTTCACCATGTT,pLKO.1,1739,3UTR,90,89,,,Y,400464,LOC400464,CCGGGAGATGGAGTTTCACCATGTTCTCGAGAACATGGTGAAACTCCATCTCTTTTTG,AATTCAAAAAGAGATGGAGTTTCACCATGTTCTCGAGAACATGGTGAAACTCCATCTC,n/a
human,128989,TANGO2,NM_001322167.1,TRCN0000140238,NM_024895.3-1807s1c1,GTCTCCCAAAGTGCTAGGATT,pLKO.1,1806,3UTR,90,89,,,Y,79955,PDZD7,CCGGGTCTCCCAAAGTGCTAGGATTCTCGAGAATCCTAGCACTTTGGGAGACTTTTTG,AATTCAAAAAGTCTCCCAAAGTGCTAGGATTCTCGAGAATCCTAGCACTTTGGGAGAC,n/a
human,128989,TANGO2,NM_001322167.1,TRCN0000129445,NM_145048.2-1500s1c1,GACTTCCAAAGTGCTGGGATT,pLKO.1,1806,3UTR,90,89,,,Y,133015,PACRGL,CCGGGACTTCCAAAGTGCTGGGATTCTCGAGAATCCCAGCACTTTGGAAGTCTTTTTG,AATTCAAAAAGACTTCCAAAGTGCTGGGATTCTCGAGAATCCCAGCACTTTGGAAGTC,n/a
human,128989,TANGO2,NM_001322167.1,TRCN0000140759,NM_018265.1-3067s1c1,GCCTTTCAAAGTGCTGGGATT,pLKO.1,1806,3UTR,90,89,,,Y,55765,INAVA,CCGGGCCTTTCAAAGTGCTGGGATTCTCGAGAATCCCAGCACTTTGAAAGGCTTTTTG,AATTCAAAAAGCCTTTCAAAGTGCTGGGATTCTCGAGAATCCCAGCACTTTGAAAGGC,n/a
human,128989,TANGO2,NM_001322167.1,TRCN0000155070,NM_017873.2-2761s1c1,GCCTTTCAAAGTGCTGGGATT,pLKO.1,1806,3UTR,90,89,,,Y,140459,ASB6,CCGGGCCTTTCAAAGTGCTGGGATTCTCGAGAATCCCAGCACTTTGAAAGGCTTTTTG,AATTCAAAAAGCCTTTCAAAGTGCTGGGATTCTCGAGAATCCCAGCACTTTGAAAGGC,n/a
human,128989,TANGO2,NM_001322167.1,TRCN0000165025,NM_207497.1-421s1c1,GTGCTAGGATTATAGGCGTGA,pLKO.1,1816,3UTR,90,89,,,Y,401253,LINC00336,CCGGGTGCTAGGATTATAGGCGTGACTCGAGTCACGCCTATAATCCTAGCACTTTTTG,AATTCAAAAAGTGCTAGGATTATAGGCGTGACTCGAGTCACGCCTATAATCCTAGCAC,n/a
human,128989,TANGO2,NM_001322167.1,TRCN0000163829,NM_173639.1-1102s1c1,CCTCCCAAATTACTGGGATTA,pLKO.1,1807,3UTR,90,89,,,Y,284618,RUSC1-AS1,CCGGCCTCCCAAATTACTGGGATTACTCGAGTAATCCCAGTAATTTGGGAGGTTTTTG,AATTCAAAAACCTCCCAAATTACTGGGATTACTCGAGTAATCCCAGTAATTTGGGAGG,n/a
human,128989,TANGO2,NM_001322167.1,TRCN0000057398,NM_002261.1-793s1c1,CCTCCCAAGTTGCTGGGATTA,pLKO.1,1807,3UTR,90,89,,,Y,3823,KLRC3,CCGGCCTCCCAAGTTGCTGGGATTACTCGAGTAATCCCAGCAACTTGGGAGGTTTTTG,AATTCAAAAACCTCCCAAGTTGCTGGGATTACTCGAGTAATCCCAGCAACTTGGGAGG,n/a
human,128989,TANGO2,NM_001322167.1,TRCN0000140374,NM_025042.2-1098s1c1,GCTTCCCAAAGTACTGGGATT,pLKO.1,1806,3UTR,90,89,,,Y,,,CCGGGCTTCCCAAAGTACTGGGATTCTCGAGAATCCCAGTACTTTGGGAAGCTTTTTG,AATTCAAAAAGCTTCCCAAAGTACTGGGATTCTCGAGAATCCCAGTACTTTGGGAAGC,n/a
human,128989,TANGO2,NM_001322167.1,TRCN0000413592,NM_199136.3-270s21c1,CCAACAGGGATGGATTGTAAA,pLKO_005,301,CDS,85,89,,,Y,340277,FAM221A,CCGGCCAACAGGGATGGATTGTAAACTCGAGTTTACAATCCATCCCTGTTGGTTTTTG,AATTCAAAAACCAACAGGGATGGATTGTAAACTCGAGTTTACAATCCATCCCTGTTGG,n/a
human,128989,TANGO2,NM_001322167.1,TRCN0000091420,NM_007599.1-1245s1c1,TCCCATCTTCAAGCAATTCTT,pLKO.1,1644,3UTR,85,89,,,Y,12332,Capg,CCGGTCCCATCTTCAAGCAATTCTTCTCGAGAAGAATTGCTTGAAGATGGGATTTTTG,AATTCAAAAATCCCATCTTCAAGCAATTCTTCTCGAGAAGAATTGCTTGAAGATGGGA,n/a
human,128989,TANGO2,NM_001322167.1,TRCN0000318310,NM_007599.3-1055s21c1,TCCCATCTTCAAGCAATTCTT,pLKO_005,1644,3UTR,85,89,,,Y,12332,Capg,CCGGTCCCATCTTCAAGCAATTCTTCTCGAGAAGAATTGCTTGAAGATGGGATTTTTG,AATTCAAAAATCCCATCTTCAAGCAATTCTTCTCGAGAAGAATTGCTTGAAGATGGGA,n/a
human,128989,TANGO2,NM_001322167.1,TRCN0000179611,NM_177731.2-751s1c1,GAAGAGTAGTCTGTGCTCTTA,pLKO.1,3065,3UTR,85,89,,,Y,242574,C130073F10Rik,CCGGGAAGAGTAGTCTGTGCTCTTACTCGAGTAAGAGCACAGACTACTCTTCTTTTTG,AATTCAAAAAGAAGAGTAGTCTGTGCTCTTACTCGAGTAAGAGCACAGACTACTCTTC,n/a
human,128989,TANGO2,NM_001322167.1,TRCN0000173395,NM_172762.2-2422s1c1,GCTGACCTTGAACTCAGAAAT,pLKO.1,2788,3UTR,80,89,,,Y,52202,Rbm34,CCGGGCTGACCTTGAACTCAGAAATCTCGAGATTTCTGAGTTCAAGGTCAGCTTTTTG,AATTCAAAAAGCTGACCTTGAACTCAGAAATCTCGAGATTTCTGAGTTCAAGGTCAGC,n/a
human,128989,TANGO2,NM_001322167.1,TRCN0000245026,NM_028227.2-2021s21c1,CGGAAGTGTGGGCCCTAATAA,pLKO_005,3289,3UTR,80,89,,,Y,72399,Brap,CCGGCGGAAGTGTGGGCCCTAATAACTCGAGTTATTAGGGCCCACACTTCCGTTTTTG,AATTCAAAAACGGAAGTGTGGGCCCTAATAACTCGAGTTATTAGGGCCCACACTTCCG,n/a
human,128989,TANGO2,NM_001322167.1,TRCN0000166364,NM_181337.2-1227s1c1,CACACACACACACACACACAA,pLKO.1,1296,3UTR,80,89,,,Y,353219,KAAG1,CCGGCACACACACACACACACACAACTCGAGTTGTGTGTGTGTGTGTGTGTGTTTTTG,AATTCAAAAACACACACACACACACACACAACTCGAGTTGTGTGTGTGTGTGTGTGTG,n/a
human,128989,TANGO2,NM_001322167.1,TRCN0000367983,NM_198655.2-689s21c1,TTGGATTGGGCACCAAGATAA,pLKO_005,1515,3UTR,81,85,,,Y,381393,4921509C19Rik,CCGGTTGGATTGGGCACCAAGATAACTCGAGTTATCTTGGTGCCCAATCCAATTTTTG,AATTCAAAAATTGGATTGGGCACCAAGATAACTCGAGTTATCTTGGTGCCCAATCCAA,n/a
