Taxon,"Gene ID","Gene Symbol",Transcript,"Clone ID","Legacy Clone Name","Target Seq",Vector,"Match Position","Match Region","Match %","SDR Match %","Intrinsic Score","Adjusted Score","Matches Other Gene in Same Taxon?","Orig. Target Gene ID","Orig. Target Gene Symbol","Forward Oligo Sequence","Reverse Oligo Sequence",Addgene
human,51134,CEP83,NM_001346460.2,TRCN0000242816,NM_016122.2-704s21c1,TTACGATGTGAGCATCATAAA,pLKO_005,583,CDS,100,100,13.2,18.48,N,51134,CEP83,CCGGTTACGATGTGAGCATCATAAACTCGAGTTTATGATGCTCACATCGTAATTTTTG,AATTCAAAAATTACGATGTGAGCATCATAAACTCGAGTTTATGATGCTCACATCGTAA,n/a
human,51134,CEP83,NM_001346460.2,TRCN0000242815,NM_016122.2-1480s21c1,GCATAAAGCTGAACGAGAAAT,pLKO_005,1359,CDS,100,100,13.2,10.56,N,51134,CEP83,CCGGGCATAAAGCTGAACGAGAAATCTCGAGATTTCTCGTTCAGCTTTATGCTTTTTG,AATTCAAAAAGCATAAAGCTGAACGAGAAATCTCGAGATTTCTCGTTCAGCTTTATGC,n/a
human,51134,CEP83,NM_001346460.2,TRCN0000242817,NM_016122.2-1269s21c1,AGGCTGAAGTAGCGGAATTAA,pLKO_005,1148,CDS,100,100,15,10.5,N,51134,CEP83,CCGGAGGCTGAAGTAGCGGAATTAACTCGAGTTAATTCCGCTACTTCAGCCTTTTTTG,AATTCAAAAAAGGCTGAAGTAGCGGAATTAACTCGAGTTAATTCCGCTACTTCAGCCT,n/a
human,51134,CEP83,NM_001346460.2,TRCN0000167263,NM_016122.1-765s1c1,CATACATTTCTCAAGTCAGAA,pLKO.1,928,CDS,100,100,4.95,3.465,N,51134,CEP83,CCGGCATACATTTCTCAAGTCAGAACTCGAGTTCTGACTTGAGAAATGTATGTTTTTG,AATTCAAAAACATACATTTCTCAAGTCAGAACTCGAGTTCTGACTTGAGAAATGTATG,n/a
human,51134,CEP83,NM_001346460.2,TRCN0000168559,NM_016122.1-1149s1c1,GAGCTACAATCAAGCAGTGAA,pLKO.1,1312,CDS,100,100,4.95,3.465,N,51134,CEP83,CCGGGAGCTACAATCAAGCAGTGAACTCGAGTTCACTGCTTGATTGTAGCTCTTTTTG,AATTCAAAAAGAGCTACAATCAAGCAGTGAACTCGAGTTCACTGCTTGATTGTAGCTC,n/a
human,51134,CEP83,NM_001346460.2,TRCN0000168620,NM_016122.1-993s1c1,GTAGCGGAATTAAAGGCTGAA,pLKO.1,1156,CDS,100,100,4.05,2.835,N,51134,CEP83,CCGGGTAGCGGAATTAAAGGCTGAACTCGAGTTCAGCCTTTAATTCCGCTACTTTTTG,AATTCAAAAAGTAGCGGAATTAAAGGCTGAACTCGAGTTCAGCCTTTAATTCCGCTAC,n/a
human,51134,CEP83,NM_001346460.2,TRCN0000164801,NM_016534.2-1646s1c1,CCTCCCAAAGTACTGGGATTA,pLKO.1,2217,3UTR,100,100,1.08,.54,Y,51275,MAPKAPK5-AS1,CCGGCCTCCCAAAGTACTGGGATTACTCGAGTAATCCCAGTACTTTGGGAGGTTTTTG,AATTCAAAAACCTCCCAAAGTACTGGGATTACTCGAGTAATCCCAGTACTTTGGGAGG,n/a
human,51134,CEP83,NM_001346460.2,TRCN0000116227,NM_024930.1-2895s1c1,CCTCCCAAAGTTCTGGGATTA,pLKO.1,2217,3UTR,95,95,,,Y,79993,ELOVL7,CCGGCCTCCCAAAGTTCTGGGATTACTCGAGTAATCCCAGAACTTTGGGAGGTTTTTG,AATTCAAAAACCTCCCAAAGTTCTGGGATTACTCGAGTAATCCCAGAACTTTGGGAGG,n/a
human,51134,CEP83,NM_001346460.2,TRCN0000164591,NM_003281.3-2102s1c1,CCTCCCAAAGTTCTGGGATTA,pLKO.1,2217,3UTR,95,95,,,Y,7135,TNNI1,CCGGCCTCCCAAAGTTCTGGGATTACTCGAGTAATCCCAGAACTTTGGGAGGTTTTTG,AATTCAAAAACCTCCCAAAGTTCTGGGATTACTCGAGTAATCCCAGAACTTTGGGAGG,n/a
human,51134,CEP83,NM_001346460.2,TRCN0000163829,NM_173639.1-1102s1c1,CCTCCCAAATTACTGGGATTA,pLKO.1,2217,3UTR,95,95,,,Y,284618,RUSC1-AS1,CCGGCCTCCCAAATTACTGGGATTACTCGAGTAATCCCAGTAATTTGGGAGGTTTTTG,AATTCAAAAACCTCCCAAATTACTGGGATTACTCGAGTAATCCCAGTAATTTGGGAGG,n/a
human,51134,CEP83,NM_001346460.2,TRCN0000140374,NM_025042.2-1098s1c1,GCTTCCCAAAGTACTGGGATT,pLKO.1,2216,3UTR,95,95,,,Y,,,CCGGGCTTCCCAAAGTACTGGGATTCTCGAGAATCCCAGTACTTTGGGAAGCTTTTTG,AATTCAAAAAGCTTCCCAAAGTACTGGGATTCTCGAGAATCCCAGTACTTTGGGAAGC,n/a
human,51134,CEP83,NM_001346460.2,TRCN0000091448,NM_013513.1-2495s1c1,CCTCCCAAGTACTGGGATTAA,pLKO.1,2217,3UTR,90,95,,,Y,13828,Epb42,CCGGCCTCCCAAGTACTGGGATTAACTCGAGTTAATCCCAGTACTTGGGAGGTTTTTG,AATTCAAAAACCTCCCAAGTACTGGGATTAACTCGAGTTAATCCCAGTACTTGGGAGG,n/a
human,51134,CEP83,NM_001346460.2,TRCN0000155836,NM_198582.1-3275s1c1,CCCAAAGTGCTGGGATTACAA,pLKO.1,2220,3UTR,90,95,,,Y,377007,KLHL30,CCGGCCCAAAGTGCTGGGATTACAACTCGAGTTGTAATCCCAGCACTTTGGGTTTTTG,AATTCAAAAACCCAAAGTGCTGGGATTACAACTCGAGTTGTAATCCCAGCACTTTGGG,n/a
human,51134,CEP83,NM_001346460.2,TRCN0000264189,NM_001085490.1-613s21c1,CAAGTAGCTGGGACTACAGGA,pLKO_005,2088,3UTR,90,95,,,Y,285501,LINC01098,CCGGCAAGTAGCTGGGACTACAGGACTCGAGTCCTGTAGTCCCAGCTACTTGTTTTTG,AATTCAAAAACAAGTAGCTGGGACTACAGGACTCGAGTCCTGTAGTCCCAGCTACTTG,n/a
human,51134,CEP83,NM_001346460.2,TRCN0000141025,NM_152361.1-835s1c1,CCCAAAGTGCTGGGATTACTT,pLKO.1,2220,3UTR,85,95,,,Y,126272,EID2B,CCGGCCCAAAGTGCTGGGATTACTTCTCGAGAAGTAATCCCAGCACTTTGGGTTTTTG,AATTCAAAAACCCAAAGTGCTGGGATTACTTCTCGAGAAGTAATCCCAGCACTTTGGG,n/a
human,51134,CEP83,NM_001346460.2,TRCN0000037108,NM_019988.2-299s1c1,GTATGATCTCAACTCCAATAA,pLKO.1,2941,3UTR,81,90,,,Y,56716,Mlst8,CCGGGTATGATCTCAACTCCAATAACTCGAGTTATTGGAGTTGAGATCATACTTTTTG,AATTCAAAAAGTATGATCTCAACTCCAATAACTCGAGTTATTGGAGTTGAGATCATAC,n/a
human,51134,CEP83,NM_001346460.2,TRCN0000106115,NM_183018.2-1329s1c1,GCCCAAAGAATCAGGTGCATT,pLKO.1,1207,CDS,81,90,,,Y,116837,Rims1,CCGGGCCCAAAGAATCAGGTGCATTCTCGAGAATGCACCTGATTCTTTGGGCTTTTTG,AATTCAAAAAGCCCAAAGAATCAGGTGCATTCTCGAGAATGCACCTGATTCTTTGGGC,n/a
human,51134,CEP83,NM_001346460.2,TRCN0000172468,NM_178520.2-2286s1c1,CCTCTCAAAGCACTGGGATTA,pLKO.1,2217,3UTR,90,89,,,Y,284186,TMEM105,CCGGCCTCTCAAAGCACTGGGATTACTCGAGTAATCCCAGTGCTTTGAGAGGTTTTTG,AATTCAAAAACCTCTCAAAGCACTGGGATTACTCGAGTAATCCCAGTGCTTTGAGAGG,n/a
human,51134,CEP83,NM_001346460.2,TRCN0000204533,NM_001013675.1-1987s1c1,CCTCCCAAAGTGCTGGAATTA,pLKO.1,2217,3UTR,90,89,,,Y,400891,LRRC74B,CCGGCCTCCCAAAGTGCTGGAATTACTCGAGTAATTCCAGCACTTTGGGAGGTTTTTG,AATTCAAAAACCTCCCAAAGTGCTGGAATTACTCGAGTAATTCCAGCACTTTGGGAGG,n/a
human,51134,CEP83,NM_001346460.2,TRCN0000072628,NM_016065.3-1636s1c1,CCTCCCAAAGTGCTAGGATTA,pLKO.1,2217,3UTR,90,89,,,Y,51021,MRPS16,CCGGCCTCCCAAAGTGCTAGGATTACTCGAGTAATCCTAGCACTTTGGGAGGTTTTTG,AATTCAAAAACCTCCCAAAGTGCTAGGATTACTCGAGTAATCCTAGCACTTTGGGAGG,n/a
human,51134,CEP83,NM_001346460.2,TRCN0000165774,NM_001012391.1-946s1c1,CCTCCTAAGTAGCTGGGATTA,pLKO.1,2517,3UTR,90,89,,,Y,100652781,SNX29P1,CCGGCCTCCTAAGTAGCTGGGATTACTCGAGTAATCCCAGCTACTTAGGAGGTTTTTG,AATTCAAAAACCTCCTAAGTAGCTGGGATTACTCGAGTAATCCCAGCTACTTAGGAGG,n/a
human,51134,CEP83,NM_001346460.2,TRCN0000200726,NM_029852.1-1336s1c1,GAACTACAATCAAGCAATGAA,pLKO.1,1312,CDS,90,89,,,Y,77048,Cep83,CCGGGAACTACAATCAAGCAATGAACTCGAGTTCATTGCTTGATTGTAGTTCTTTTTG,AATTCAAAAAGAACTACAATCAAGCAATGAACTCGAGTTCATTGCTTGATTGTAGTTC,n/a
human,51134,CEP83,NM_001346460.2,TRCN0000165534,NM_001012717.1-362s1c1,GAGACAGGGTTTCACCATGTT,pLKO.1,2149,3UTR,90,89,,,Y,,,CCGGGAGACAGGGTTTCACCATGTTCTCGAGAACATGGTGAAACCCTGTCTCTTTTTG,AATTCAAAAAGAGACAGGGTTTCACCATGTTCTCGAGAACATGGTGAAACCCTGTCTC,n/a
human,51134,CEP83,NM_001346460.2,TRCN0000073773,NM_022164.1-1914s1c1,CCTCTCAAGTAGCTGGGACTA,pLKO.1,2083,3UTR,90,89,,,Y,64129,TINAGL1,CCGGCCTCTCAAGTAGCTGGGACTACTCGAGTAGTCCCAGCTACTTGAGAGGTTTTTG,AATTCAAAAACCTCTCAAGTAGCTGGGACTACTCGAGTAGTCCCAGCTACTTGAGAGG,n/a
human,51134,CEP83,NM_001346460.2,TRCN0000008902,NM_016540.2-2291s1c1,CCTCCCAAAGTGTTGGGATTA,pLKO.1,2217,3UTR,90,89,,,Y,10888,GPR83,CCGGCCTCCCAAAGTGTTGGGATTACTCGAGTAATCCCAACACTTTGGGAGGTTTTTG,AATTCAAAAACCTCCCAAAGTGTTGGGATTACTCGAGTAATCCCAACACTTTGGGAGG,n/a
human,51134,CEP83,NM_001346460.2,TRCN0000156315,NM_020702.1-3633s1c1,CCTCCCAAAGTGTTGGGATTA,pLKO.1,2217,3UTR,90,89,,,Y,57462,MYORG,CCGGCCTCCCAAAGTGTTGGGATTACTCGAGTAATCCCAACACTTTGGGAGGTTTTTG,AATTCAAAAACCTCCCAAAGTGTTGGGATTACTCGAGTAATCCCAACACTTTGGGAGG,n/a
human,51134,CEP83,NM_001346460.2,TRCN0000040213,NM_000618.2-6169s1c1,CCTCCCAAATTGCTGGGATTA,pLKO.1,2083,3UTR,90,89,,,Y,3479,IGF1,CCGGCCTCCCAAATTGCTGGGATTACTCGAGTAATCCCAGCAATTTGGGAGGTTTTTG,AATTCAAAAACCTCCCAAATTGCTGGGATTACTCGAGTAATCCCAGCAATTTGGGAGG,n/a
human,51134,CEP83,NM_001346460.2,TRCN0000023813,XM_140038.3-1071s1c1,CTGGAGGAAGATCAAAGACAA,pLKO.1,1024,CDS,85,89,,,Y,210619,LOC210619,CCGGCTGGAGGAAGATCAAAGACAACTCGAGTTGTCTTTGATCTTCCTCCAGTTTTTG,AATTCAAAAACTGGAGGAAGATCAAAGACAACTCGAGTTGTCTTTGATCTTCCTCCAG,n/a
human,51134,CEP83,NM_001346460.2,TRCN0000429173,NM_020358.2-1545s21c1,ACCAGCCGAGTAGGATTATTC,pLKO_005,2253,3UTR,85,89,,,Y,57093,TRIM49,CCGGACCAGCCGAGTAGGATTATTCCTCGAGGAATAATCCTACTCGGCTGGTTTTTTG,AATTCAAAAAACCAGCCGAGTAGGATTATTCCTCGAGGAATAATCCTACTCGGCTGGT,n/a
human,51134,CEP83,NM_001346460.2,TRCN0000162795,NM_017842.1-1079s1c1,CTTCCAAAGTGCTGGGATTAT,pLKO.1,2218,3UTR,85,89,,,Y,55652,SLC48A1,CCGGCTTCCAAAGTGCTGGGATTATCTCGAGATAATCCCAGCACTTTGGAAGTTTTTG,AATTCAAAAACTTCCAAAGTGCTGGGATTATCTCGAGATAATCCCAGCACTTTGGAAG,n/a
human,51134,CEP83,NM_001346460.2,TRCN0000140657,NM_012099.1-2957s1c1,CCTCCCAAAGTGCTAGGATAA,pLKO.1,2217,3UTR,85,89,,,Y,10849,CD3EAP,CCGGCCTCCCAAAGTGCTAGGATAACTCGAGTTATCCTAGCACTTTGGGAGGTTTTTG,AATTCAAAAACCTCCCAAAGTGCTAGGATAACTCGAGTTATCCTAGCACTTTGGGAGG,n/a
human,51134,CEP83,NM_001346460.2,TRCN0000157610,NM_024565.4-569s1c1,GTGGCATGATCTCAGCTCATT,pLKO.1,2020,3UTR,85,89,,,Y,79616,CCNJL,CCGGGTGGCATGATCTCAGCTCATTCTCGAGAATGAGCTGAGATCATGCCACTTTTTG,AATTCAAAAAGTGGCATGATCTCAGCTCATTCTCGAGAATGAGCTGAGATCATGCCAC,n/a
human,51134,CEP83,NM_001346460.2,TRCN0000026286,NM_181543.1-1406s1c1,GCAAAGATTTCTGCTTTCAAA,pLKO.1,2735,3UTR,80,89,,,Y,240239,Gpr151,CCGGGCAAAGATTTCTGCTTTCAAACTCGAGTTTGAAAGCAGAAATCTTTGCTTTTTG,AATTCAAAAAGCAAAGATTTCTGCTTTCAAACTCGAGTTTGAAAGCAGAAATCTTTGC,n/a
human,51134,CEP83,NM_001346460.2,TRCN0000243956,NM_032326.2-374s21c1,GGCAGCACACACAAGGTTGTT,pLKO_005,624,CDS,80,89,,,Y,84286,TMEM175,CCGGGGCAGCACACACAAGGTTGTTCTCGAGAACAACCTTGTGTGTGCTGCCTTTTTG,AATTCAAAAAGGCAGCACACACAAGGTTGTTCTCGAGAACAACCTTGTGTGTGCTGCC,n/a
human,51134,CEP83,NM_001346460.2,TRCN0000134446,NM_004607.1-323s1c1,GAGGAATATAAAGAAGCACGT,pLKO.1,1027,CDS,80,89,,,Y,6902,TBCA,CCGGGAGGAATATAAAGAAGCACGTCTCGAGACGTGCTTCTTTATATTCCTCTTTTTG,AATTCAAAAAGAGGAATATAAAGAAGCACGTCTCGAGACGTGCTTCTTTATATTCCTC,n/a
human,51134,CEP83,NM_001346460.2,TRCN0000096419,XM_358939.1-183s1c1,CGCCTGCTGCTGCTGCTGCAA,pLKO.1,1528,3UTR,80,89,,,Y,195333,Gsc2,CCGGCGCCTGCTGCTGCTGCTGCAACTCGAGTTGCAGCAGCAGCAGCAGGCGTTTTTG,AATTCAAAAACGCCTGCTGCTGCTGCTGCAACTCGAGTTGCAGCAGCAGCAGCAGGCG,n/a
human,51134,CEP83,NM_001346460.2,TRCN0000366901,NM_019988.3-299s21c1,TATGATCTCAACTCCAATAAC,pLKO_005,2942,3UTR,77,85,,,Y,56716,Mlst8,CCGGTATGATCTCAACTCCAATAACCTCGAGGTTATTGGAGTTGAGATCATATTTTTG,AATTCAAAAATATGATCTCAACTCCAATAACCTCGAGGTTATTGGAGTTGAGATCATA,n/a
