Taxon,"Gene ID","Gene Symbol",Transcript,"Clone ID","Legacy Clone Name","Target Seq",Vector,"Match Position","Match Region","Match %","SDR Match %","Intrinsic Score","Adjusted Score","Matches Other Gene in Same Taxon?","Orig. Target Gene ID","Orig. Target Gene Symbol","Forward Oligo Sequence","Reverse Oligo Sequence",Addgene
human,84273,NOA1,NM_032313.4,TRCN0000147467,NM_032313.2-1513s1c1,CAAGTAGAATTGACTGCACAA,pLKO.1,1459,CDS,100,100,4.05,3.24,N,84273,NOA1,CCGGCAAGTAGAATTGACTGCACAACTCGAGTTGTGCAGTCAATTCTACTTGTTTTTG,AATTCAAAAACAAGTAGAATTGACTGCACAACTCGAGTTGTGCAGTCAATTCTACTTG,n/a
human,84273,NOA1,NM_032313.4,TRCN0000129917,NM_032313.2-1724s1c1,GAAATCAGTCAGCTTGGTTTA,pLKO.1,1670,CDS,100,100,10.8,7.56,N,84273,NOA1,CCGGGAAATCAGTCAGCTTGGTTTACTCGAGTAAACCAAGCTGACTGATTTCTTTTTG,AATTCAAAAAGAAATCAGTCAGCTTGGTTTACTCGAGTAAACCAAGCTGACTGATTTC,n/a
human,84273,NOA1,NM_032313.4,TRCN0000150281,NM_032313.2-1258s1c1,CCAACTCCTTACAGAATGTTT,pLKO.1,1204,CDS,100,100,5.625,3.9375,N,84273,NOA1,CCGGCCAACTCCTTACAGAATGTTTCTCGAGAAACATTCTGTAAGGAGTTGGTTTTTG,AATTCAAAAACCAACTCCTTACAGAATGTTTCTCGAGAAACATTCTGTAAGGAGTTGG,n/a
human,84273,NOA1,NM_032313.4,TRCN0000292155,NM_032313.2-1258s21c1,CCAACTCCTTACAGAATGTTT,pLKO_005,1204,CDS,100,100,5.625,3.9375,N,84273,NOA1,CCGGCCAACTCCTTACAGAATGTTTCTCGAGAAACATTCTGTAAGGAGTTGGTTTTTG,AATTCAAAAACCAACTCCTTACAGAATGTTTCTCGAGAAACATTCTGTAAGGAGTTGG,n/a
human,84273,NOA1,NM_032313.4,TRCN0000128420,NM_032313.2-1441s1c1,GAGTTTGATGCTGATTCACTT,pLKO.1,1387,CDS,100,100,4.95,3.465,N,84273,NOA1,CCGGGAGTTTGATGCTGATTCACTTCTCGAGAAGTGAATCAGCATCAAACTCTTTTTG,AATTCAAAAAGAGTTTGATGCTGATTCACTTCTCGAGAAGTGAATCAGCATCAAACTC,n/a
human,84273,NOA1,NM_032313.4,TRCN0000146669,NM_032313.2-1420s1c1,CAGAAGGATAACATTCCCTTT,pLKO.1,1366,CDS,100,100,4.05,2.835,N,84273,NOA1,CCGGCAGAAGGATAACATTCCCTTTCTCGAGAAAGGGAATGTTATCCTTCTGTTTTTG,AATTCAAAAACAGAAGGATAACATTCCCTTTCTCGAGAAAGGGAATGTTATCCTTCTG,n/a
human,84273,NOA1,NM_032313.4,TRCN0000281396,NM_032313.2-1420s21c1,CAGAAGGATAACATTCCCTTT,pLKO_005,1366,CDS,100,100,4.05,2.835,N,84273,NOA1,CCGGCAGAAGGATAACATTCCCTTTCTCGAGAAAGGGAATGTTATCCTTCTGTTTTTG,AATTCAAAAACAGAAGGATAACATTCCCTTTCTCGAGAAAGGGAATGTTATCCTTCTG,n/a
human,84273,NOA1,NM_032313.4,TRCN0000149579,NM_032313.2-1215s1c1,GCCAGGTACTACATTAAACCT,pLKO.1,1161,CDS,100,100,3,2.1,N,84273,NOA1,CCGGGCCAGGTACTACATTAAACCTCTCGAGAGGTTTAATGTAGTACCTGGCTTTTTG,AATTCAAAAAGCCAGGTACTACATTAAACCTCTCGAGAGGTTTAATGTAGTACCTGGC,n/a
human,84273,NOA1,NM_032313.4,TRCN0000292156,NM_032313.2-1215s21c1,GCCAGGTACTACATTAAACCT,pLKO_005,1161,CDS,100,100,3,2.1,N,84273,NOA1,CCGGGCCAGGTACTACATTAAACCTCTCGAGAGGTTTAATGTAGTACCTGGCTTTTTG,AATTCAAAAAGCCAGGTACTACATTAAACCTCTCGAGAGGTTTAATGTAGTACCTGGC,n/a
human,84273,NOA1,NM_032313.4,TRCN0000149824,NM_032313.2-2127s1c1,CCTTATGTACAACGTGAGGAA,pLKO.1,2073,CDS,100,100,2.64,1.848,N,84273,NOA1,CCGGCCTTATGTACAACGTGAGGAACTCGAGTTCCTCACGTTGTACATAAGGTTTTTG,AATTCAAAAACCTTATGTACAACGTGAGGAACTCGAGTTCCTCACGTTGTACATAAGG,n/a
human,84273,NOA1,NM_032313.4,TRCN0000150134,NM_032313.2-1324s1c1,GATCTTAGTGAGCAAGAACAA,pLKO.1,1270,CDS,100,100,4.95,2.97,N,84273,NOA1,CCGGGATCTTAGTGAGCAAGAACAACTCGAGTTGTTCTTGCTCACTAAGATCTTTTTG,AATTCAAAAAGATCTTAGTGAGCAAGAACAACTCGAGTTGTTCTTGCTCACTAAGATC,n/a
human,84273,NOA1,NM_032313.4,TRCN0000281319,NM_032313.2-1324s21c1,GATCTTAGTGAGCAAGAACAA,pLKO_005,1270,CDS,100,100,4.95,2.97,N,84273,NOA1,CCGGGATCTTAGTGAGCAAGAACAACTCGAGTTGTTCTTGCTCACTAAGATCTTTTTG,AATTCAAAAAGATCTTAGTGAGCAAGAACAACTCGAGTTGTTCTTGCTCACTAAGATC,n/a
human,84273,NOA1,NM_032313.4,TRCN0000129369,NM_032313.2-1048s1c1,GAAGAGTTGATCTCTGCCCTT,pLKO.1,994,CDS,100,100,2.16,1.296,N,84273,NOA1,CCGGGAAGAGTTGATCTCTGCCCTTCTCGAGAAGGGCAGAGATCAACTCTTCTTTTTG,AATTCAAAAAGAAGAGTTGATCTCTGCCCTTCTCGAGAAGGGCAGAGATCAACTCTTC,n/a
human,84273,NOA1,NM_032313.4,TRCN0000292157,NM_032313.2-1048s21c1,GAAGAGTTGATCTCTGCCCTT,pLKO_005,994,CDS,100,100,2.16,1.296,N,84273,NOA1,CCGGGAAGAGTTGATCTCTGCCCTTCTCGAGAAGGGCAGAGATCAACTCTTCTTTTTG,AATTCAAAAAGAAGAGTTGATCTCTGCCCTTCTCGAGAAGGGCAGAGATCAACTCTTC,n/a
human,84273,NOA1,NM_032313.4,TRCN0000201568,NM_019836.1-1808s1c1,CCCTCTTGTTGCTGAAGACAT,pLKO.1,1824,CDS,95,95,,,N,56412,Noa1,CCGGCCCTCTTGTTGCTGAAGACATCTCGAGATGTCTTCAGCAACAAGAGGGTTTTTG,AATTCAAAAACCCTCTTGTTGCTGAAGACATCTCGAGATGTCTTCAGCAACAAGAGGG,n/a
human,84273,NOA1,NM_032313.4,TRCN0000248587,NM_133923.6-488s21c1,TCAAGCAGAAGAAGATCTTTA,pLKO_005,1257,CDS,85,95,,,Y,101100,Ttll3,CCGGTCAAGCAGAAGAAGATCTTTACTCGAGTAAAGATCTTCTTCTGCTTGATTTTTG,AATTCAAAAATCAAGCAGAAGAAGATCTTTACTCGAGTAAAGATCTTCTTCTGCTTGA,n/a
human,84273,NOA1,NM_032313.4,TRCN0000282985,NM_019836.2-1892s21c1,GGTTGCAGTAACACCTTATTC,pLKO_005,1911,CDS,85,89,,,N,56412,Noa1,CCGGGGTTGCAGTAACACCTTATTCCTCGAGGAATAAGGTGTTACTGCAACCTTTTTG,AATTCAAAAAGGTTGCAGTAACACCTTATTCCTCGAGGAATAAGGTGTTACTGCAACC,n/a
human,84273,NOA1,NM_032313.4,TRCN0000264300,NM_019836.2-1977s21c1,GTCTTGCCATATATCGTTAAT,pLKO_005,1996,CDS,85,89,,,N,56412,Noa1,CCGGGTCTTGCCATATATCGTTAATCTCGAGATTAACGATATATGGCAAGACTTTTTG,AATTCAAAAAGTCTTGCCATATATCGTTAATCTCGAGATTAACGATATATGGCAAGAC,n/a
human,84273,NOA1,NM_032313.4,TRCN0000013823,NM_004424.2-2411s1c1,GACAGGGCAGAGGACTCTGAA,pLKO.1,1735,CDS,85,89,,,Y,1877,E4F1,CCGGGACAGGGCAGAGGACTCTGAACTCGAGTTCAGAGTCCTCTGCCCTGTCTTTTTG,AATTCAAAAAGACAGGGCAGAGGACTCTGAACTCGAGTTCAGAGTCCTCTGCCCTGTC,n/a
human,84273,NOA1,NM_032313.4,TRCN0000448354,NM_053205.1-79s21c1,AGCTTAATGTCACTCATAATC,pLKO_005,1295,CDS,80,89,,,N,111174,Taar1,CCGGAGCTTAATGTCACTCATAATCCTCGAGGATTATGAGTGACATTAAGCTTTTTTG,AATTCAAAAAAGCTTAATGTCACTCATAATCCTCGAGGATTATGAGTGACATTAAGCT,n/a
human,84273,NOA1,NM_032313.4,TRCN0000067613,NM_008382.1-1597s1c1,CCCGAGAAAGAAGTTCCTCAA,pLKO.1,500,CDS,80,89,,,N,16326,Inhbe,CCGGCCCGAGAAAGAAGTTCCTCAACTCGAGTTGAGGAACTTCTTTCTCGGGTTTTTG,AATTCAAAAACCCGAGAAAGAAGTTCCTCAACTCGAGTTGAGGAACTTCTTTCTCGGG,n/a
human,84273,NOA1,NM_032313.4,TRCN0000048836,NM_006203.3-451s1c1,CCATCAACAAAGCCACCATAA,pLKO.1,1133,CDS,80,89,,,Y,5144,PDE4D,CCGGCCATCAACAAAGCCACCATAACTCGAGTTATGGTGGCTTTGTTGATGGTTTTTG,AATTCAAAAACCATCAACAAAGCCACCATAACTCGAGTTATGGTGGCTTTGTTGATGG,n/a
human,84273,NOA1,NM_032313.4,TRCN0000047872,NM_018415.1-3460s1c1,AGGAGGAACAACAGAGGCAAA,pLKO.1,320,CDS,80,89,,,Y,55809,TRERF1,CCGGAGGAGGAACAACAGAGGCAAACTCGAGTTTGCCTCTGTTGTTCCTCCTTTTTTG,AATTCAAAAAAGGAGGAACAACAGAGGCAAACTCGAGTTTGCCTCTGTTGTTCCTCCT,n/a
human,84273,NOA1,NM_032313.4,TRCN0000085875,NM_177239.1-766s1c1,CCACCAATCAAGGAGAATTAT,pLKO.1,1451,CDS,80,89,,,Y,320713,Mysm1,CCGGCCACCAATCAAGGAGAATTATCTCGAGATAATTCTCCTTGATTGGTGGTTTTTG,AATTCAAAAACCACCAATCAAGGAGAATTATCTCGAGATAATTCTCCTTGATTGGTGG,n/a
human,84273,NOA1,NM_032313.4,TRCN0000251388,NM_001033427.3-332s21c1,GCACTGCCAAGGGCTCATATA,pLKO_005,1112,CDS,80,89,,,Y,332427,Lyg2,CCGGGCACTGCCAAGGGCTCATATACTCGAGTATATGAGCCCTTGGCAGTGCTTTTTG,AATTCAAAAAGCACTGCCAAGGGCTCATATACTCGAGTATATGAGCCCTTGGCAGTGC,n/a
human,84273,NOA1,NM_032313.4,TRCN0000067392,NM_013657.4-2388s1c1,GCTCTCATCAACAGCAGGAAA,pLKO.1,300,CDS,80,89,,,Y,20348,Sema3c,CCGGGCTCTCATCAACAGCAGGAAACTCGAGTTTCCTGCTGTTGATGAGAGCTTTTTG,AATTCAAAAAGCTCTCATCAACAGCAGGAAACTCGAGTTTCCTGCTGTTGATGAGAGC,n/a
human,84273,NOA1,NM_032313.4,TRCN0000351375,NM_013657.5-2388s21c3,GCTCTCATCAACAGCAGGAAA,pLKO_005,300,CDS,80,89,,,Y,20348,Sema3c,CCGGGCTCTCATCAACAGCAGGAAACTCGAGTTTCCTGCTGTTGATGAGAGCTTTTTG,AATTCAAAAAGCTCTCATCAACAGCAGGAAACTCGAGTTTCCTGCTGTTGATGAGAGC,n/a
human,84273,NOA1,NM_032313.4,TRCN0000163750,NM_001013681.1-201s1c1,GCTGTATTCACTTGCCTCTTT,pLKO.1,1396,CDS,80,89,,,Y,,,CCGGGCTGTATTCACTTGCCTCTTTCTCGAGAAAGAGGCAAGTGAATACAGCTTTTTG,AATTCAAAAAGCTGTATTCACTTGCCTCTTTCTCGAGAAAGAGGCAAGTGAATACAGC,n/a
human,84273,NOA1,NM_032313.4,TRCN0000038204,NM_005116.5-1540s1c1,GCCAGCATCATCGAGTCTATT,pLKO.1,146,CDS,77,85,,,Y,9962,SLC23A2,CCGGGCCAGCATCATCGAGTCTATTCTCGAGAATAGACTCGATGATGCTGGCTTTTTG,AATTCAAAAAGCCAGCATCATCGAGTCTATTCTCGAGAATAGACTCGATGATGCTGGC,n/a
