Taxon,"Gene ID","Gene Symbol",Transcript,"Clone ID","Legacy Clone Name","Target Seq",Vector,"Match Position","Match Region","Match %","SDR Match %","Intrinsic Score","Adjusted Score","Matches Other Gene in Same Taxon?","Orig. Target Gene ID","Orig. Target Gene Symbol","Forward Oligo Sequence","Reverse Oligo Sequence",Addgene
mouse,258989,Olfr457,NM_146987.1,TRCN0000188027,NM_146987.1-165s1c1,CCACCTGCCCATGTATTTCTT,pLKO.1,165,CDS,100,100,5.625,2.8125,Y,258989,Olfr457,CCGGCCACCTGCCCATGTATTTCTTCTCGAGAAGAAATACATGGGCAGGTGGTTTTTG,AATTCAAAAACCACCTGCCCATGTATTTCTTCTCGAGAAGAAATACATGGGCAGGTGG,n/a
mouse,258989,Olfr457,NM_146987.1,TRCN0000203825,NM_146987.1-430s1c1,CTAGCAGGTGTCTCTTGGTTT,pLKO.1,430,CDS,100,100,4.95,2.475,Y,258989,Olfr457,CCGGCTAGCAGGTGTCTCTTGGTTTCTCGAGAAACCAAGAGACACCTGCTAGTTTTTG,AATTCAAAAACTAGCAGGTGTCTCTTGGTTTCTCGAGAAACCAAGAGACACCTGCTAG,n/a
mouse,258989,Olfr457,NM_146987.1,TRCN0000204174,NM_146987.1-735s1c1,GACTGTGGTCTCCATGTCTTA,pLKO.1,735,CDS,100,100,4.95,2.475,Y,258989,Olfr457,CCGGGACTGTGGTCTCCATGTCTTACTCGAGTAAGACATGGAGACCACAGTCTTTTTG,AATTCAAAAAGACTGTGGTCTCCATGTCTTACTCGAGTAAGACATGGAGACCACAGTC,n/a
mouse,258989,Olfr457,NM_146987.1,TRCN0000187848,NM_146987.1-73s1c1,GCTGGACTCTTTGTCCTCTTT,pLKO.1,73,CDS,100,100,4.95,2.475,Y,258989,Olfr457,CCGGGCTGGACTCTTTGTCCTCTTTCTCGAGAAAGAGGACAAAGAGTCCAGCTTTTTG,AATTCAAAAAGCTGGACTCTTTGTCCTCTTTCTCGAGAAAGAGGACAAAGAGTCCAGC,n/a
mouse,258989,Olfr457,NM_146987.1,TRCN0000187003,NM_001011528.1-171s1c1,CATGTATTTCTTCCTCTGTCA,pLKO.1,174,CDS,100,100,2.64,1.32,Y,259144,Olfr456,CCGGCATGTATTTCTTCCTCTGTCACTCGAGTGACAGAGGAAGAAATACATGTTTTTG,AATTCAAAAACATGTATTTCTTCCTCTGTCACTCGAGTGACAGAGGAAGAAATACATG,n/a
mouse,258989,Olfr457,NM_146987.1,TRCN0000203340,NM_146987.1-172s1c1,CCCATGTATTTCTTCCTCTGT,pLKO.1,172,CDS,100,100,2.64,1.32,Y,258989,Olfr457,CCGGCCCATGTATTTCTTCCTCTGTCTCGAGACAGAGGAAGAAATACATGGGTTTTTG,AATTCAAAAACCCATGTATTTCTTCCTCTGTCTCGAGACAGAGGAAGAAATACATGGG,n/a
mouse,258989,Olfr457,NM_146987.1,TRCN0000187271,NM_001011528.1-577s1c1,CTCAACCAAGTGGTGATACTA,pLKO.1,580,CDS,95,100,5.625,2.8125,Y,259144,Olfr456,CCGGCTCAACCAAGTGGTGATACTACTCGAGTAGTATCACCACTTGGTTGAGTTTTTG,AATTCAAAAACTCAACCAAGTGGTGATACTACTCGAGTAGTATCACCACTTGGTTGAG,n/a
mouse,258989,Olfr457,NM_146987.1,TRCN0000203926,NM_146444.1-369s1c1,CGTGGCTGTCTGTAATCCATT,pLKO.1,369,CDS,95,95,,,Y,258436,Olfr458,CCGGCGTGGCTGTCTGTAATCCATTCTCGAGAATGGATTACAGACAGCCACGTTTTTG,AATTCAAAAACGTGGCTGTCTGTAATCCATTCTCGAGAATGGATTACAGACAGCCACG,n/a
mouse,258989,Olfr457,NM_146987.1,TRCN0000583868,,GCCATGGCCTATGACCGATAT,pLKO_005,349,CDS,95,95,,,Y,343173,OR2T3,CCGGGCCATGGCCTATGACCGATATCTCGAGATATCGGTCATAGGCCATGGCTTTTTG,AATTCAAAAAGCCATGGCCTATGACCGATATCTCGAGATATCGGTCATAGGCCATGGC,n/a
mouse,258989,Olfr457,NM_146987.1,TRCN0000188465,NM_019474.1-970s1c1,CCTGAGGAACAAGGATGTGAA,pLKO.1,873,CDS,95,95,,,Y,29846,Olfr156,CCGGCCTGAGGAACAAGGATGTGAACTCGAGTTCACATCCTTGTTCCTCAGGTTTTTG,AATTCAAAAACCTGAGGAACAAGGATGTGAACTCGAGTTCACATCCTTGTTCCTCAGG,n/a
mouse,258989,Olfr457,NM_146987.1,TRCN0000186115,NM_146345.1-184s1c1,CCCATGTATTTCTTCCTCAGT,pLKO.1,172,CDS,95,95,,,Y,258342,Olfr1491,CCGGCCCATGTATTTCTTCCTCAGTCTCGAGACTGAGGAAGAAATACATGGGTTTTTG,AATTCAAAAACCCATGTATTTCTTCCTCAGTCTCGAGACTGAGGAAGAAATACATGGG,n/a
mouse,258989,Olfr457,NM_146987.1,TRCN0000187721,NM_001011528.1-664s1c1,GCTGCTATCATGAAGATCCAT,pLKO.1,667,CDS,90,95,,,Y,259144,Olfr456,CCGGGCTGCTATCATGAAGATCCATCTCGAGATGGATCTTCATGATAGCAGCTTTTTG,AATTCAAAAAGCTGCTATCATGAAGATCCATCTCGAGATGGATCTTCATGATAGCAGC,n/a
mouse,258989,Olfr457,NM_146987.1,TRCN0000189415,NM_207159.1-344s1c1,CCATGTCCTATGACCGCTATA,pLKO.1,350,CDS,90,95,,,Y,259165,Olfr814,CCGGCCATGTCCTATGACCGCTATACTCGAGTATAGCGGTCATAGGACATGGTTTTTG,AATTCAAAAACCATGTCCTATGACCGCTATACTCGAGTATAGCGGTCATAGGACATGG,n/a
mouse,258989,Olfr457,NM_146987.1,TRCN0000184921,XM_372411.1-177s1c1,CATGTATTTCTTCCTCAGTAA,pLKO.1,174,CDS,90,95,,,Y,390195,OR5AN1,CCGGCATGTATTTCTTCCTCAGTAACTCGAGTTACTGAGGAAGAAATACATGTTTTTG,AATTCAAAAACATGTATTTCTTCCTCAGTAACTCGAGTTACTGAGGAAGAAATACATG,n/a
mouse,258989,Olfr457,NM_146987.1,TRCN0000185126,NM_146345.1-185s1c1,CCATGTATTTCTTCCTCAGTA,pLKO.1,173,CDS,90,95,,,Y,258342,Olfr1491,CCGGCCATGTATTTCTTCCTCAGTACTCGAGTACTGAGGAAGAAATACATGGTTTTTG,AATTCAAAAACCATGTATTTCTTCCTCAGTACTCGAGTACTGAGGAAGAAATACATGG,n/a
mouse,258989,Olfr457,NM_146987.1,TRCN0000028987,NM_010980.1-163s1c1,CCCATGTATTTCTTCCTCAAT,pLKO.1,172,CDS,90,95,,,Y,18331,Olfr32,CCGGCCCATGTATTTCTTCCTCAATCTCGAGATTGAGGAAGAAATACATGGGTTTTTG,AATTCAAAAACCCATGTATTTCTTCCTCAATCTCGAGATTGAGGAAGAAATACATGGG,n/a
mouse,258989,Olfr457,NM_146987.1,TRCN0000358846,NM_178168.1-26s21c1,TAAGTGAATTTATCCTCATGA,pLKO_005,26,CDS,90,95,,,Y,144124,OR10A5,CCGGTAAGTGAATTTATCCTCATGACTCGAGTCATGAGGATAAATTCACTTATTTTTG,AATTCAAAAATAAGTGAATTTATCCTCATGACTCGAGTCATGAGGATAAATTCACTTA,n/a
mouse,258989,Olfr457,NM_146987.1,TRCN0000189182,NM_146656.1-169s1c1,CCCATGTACTTCTTCCTCTCT,pLKO.1,172,CDS,90,95,,,Y,258650,Olfr444,CCGGCCCATGTACTTCTTCCTCTCTCTCGAGAGAGAGGAAGAAGTACATGGGTTTTTG,AATTCAAAAACCCATGTACTTCTTCCTCTCTCTCGAGAGAGAGGAAGAAGTACATGGG,n/a
mouse,258989,Olfr457,NM_146987.1,TRCN0000009348,NM_030908.1-169s1c1,CCCATGTACTTCTTCCTCTCA,pLKO.1,172,CDS,85,95,,,Y,79541,OR2A4,CCGGCCCATGTACTTCTTCCTCTCACTCGAGTGAGAGGAAGAAGTACATGGGTTTTTG,AATTCAAAAACCCATGTACTTCTTCCTCTCACTCGAGTGAGAGGAAGAAGTACATGGG,n/a
mouse,258989,Olfr457,NM_146987.1,TRCN0000186065,NM_001011528.1-668s1c1,CTATCATGAAGATCCATTCTA,pLKO.1,671,CDS,90,89,,,Y,259144,Olfr456,CCGGCTATCATGAAGATCCATTCTACTCGAGTAGAATGGATCTTCATGATAGTTTTTG,AATTCAAAAACTATCATGAAGATCCATTCTACTCGAGTAGAATGGATCTTCATGATAG,n/a
mouse,258989,Olfr457,NM_146987.1,TRCN0000009277,NM_013940.1-673s1c1,GCCATCTTGAAGATCCCTTCT,pLKO.1,670,CDS,90,89,,,Y,26539,OR10H1,CCGGGCCATCTTGAAGATCCCTTCTCTCGAGAGAAGGGATCTTCAAGATGGCTTTTTG,AATTCAAAAAGCCATCTTGAAGATCCCTTCTCTCGAGAGAAGGGATCTTCAAGATGGC,n/a
mouse,258989,Olfr457,NM_146987.1,TRCN0000188097,XM_357989.1-372s1c1,CCGCTATGTTGCTATCTGTAA,pLKO.1,363,CDS,90,89,,,Y,18343,Olfr44,CCGGCCGCTATGTTGCTATCTGTAACTCGAGTTACAGATAGCAACATAGCGGTTTTTG,AATTCAAAAACCGCTATGTTGCTATCTGTAACTCGAGTTACAGATAGCAACATAGCGG,n/a
mouse,258989,Olfr457,NM_146987.1,TRCN0000187644,NM_146553.1-343s1c1,GCCATGTCCTATGACCGATAT,pLKO.1,349,CDS,90,89,,,Y,258546,Olfr806,CCGGGCCATGTCCTATGACCGATATCTCGAGATATCGGTCATAGGACATGGCTTTTTG,AATTCAAAAAGCCATGTCCTATGACCGATATCTCGAGATATCGGTCATAGGACATGGC,n/a
mouse,258989,Olfr457,NM_146987.1,TRCN0000188733,NM_146932.1-343s1c1,GCCATGTCCTATGACCGTTAT,pLKO.1,349,CDS,90,89,,,Y,258934,Olfr802,CCGGGCCATGTCCTATGACCGTTATCTCGAGATAACGGTCATAGGACATGGCTTTTTG,AATTCAAAAAGCCATGTCCTATGACCGTTATCTCGAGATAACGGTCATAGGACATGGC,n/a
mouse,258989,Olfr457,NM_146987.1,TRCN0000583881,,TTACTGGCTGCCATGGCTTAT,pLKO_005,340,CDS,90,89,,,Y,504191,OR9G9,CCGGTTACTGGCTGCCATGGCTTATCTCGAGATAAGCCATGGCAGCCAGTAATTTTTG,AATTCAAAAATTACTGGCTGCCATGGCTTATCTCGAGATAAGCCATGGCAGCCAGTAA,n/a
mouse,258989,Olfr457,NM_146987.1,TRCN0000204736,NM_001011861.1-343s1c1,GCCATGTCCTATGACTGCTAT,pLKO.1,349,CDS,90,89,,,Y,100502887,Olfr331,CCGGGCCATGTCCTATGACTGCTATCTCGAGATAGCAGTCATAGGACATGGCTTTTTG,AATTCAAAAAGCCATGTCCTATGACTGCTATCTCGAGATAGCAGTCATAGGACATGGC,n/a
mouse,258989,Olfr457,NM_146987.1,TRCN0000204821,NM_146811.1-349s1c1,GCAATGGCCTATGATCGCTAT,pLKO.1,349,CDS,90,89,,,Y,258807,Olfr910,CCGGGCAATGGCCTATGATCGCTATCTCGAGATAGCGATCATAGGCCATTGCTTTTTG,AATTCAAAAAGCAATGGCCTATGATCGCTATCTCGAGATAGCGATCATAGGCCATTGC,n/a
mouse,258989,Olfr457,NM_146987.1,TRCN0000187775,NM_146774.1-349s1c1,GCTATGGCCTATGATCGCTAT,pLKO.1,349,CDS,90,89,,,Y,258770,Olfr472,CCGGGCTATGGCCTATGATCGCTATCTCGAGATAGCGATCATAGGCCATAGCTTTTTG,AATTCAAAAAGCTATGGCCTATGATCGCTATCTCGAGATAGCGATCATAGGCCATAGC,n/a
mouse,258989,Olfr457,NM_146987.1,TRCN0000203243,NM_001011528.1-28s1c1,GAGTTTATCCTTATGGGTTTA,pLKO.1,31,CDS,85,89,,,Y,259144,Olfr456,CCGGGAGTTTATCCTTATGGGTTTACTCGAGTAAACCCATAAGGATAAACTCTTTTTG,AATTCAAAAAGAGTTTATCCTTATGGGTTTACTCGAGTAAACCCATAAGGATAAACTC,n/a
mouse,258989,Olfr457,NM_146987.1,TRCN0000357566,NM_175911.2-685s21c1,CATGGCCTACGACCGTTATTT,pLKO_005,351,CDS,85,89,,,Y,284521,OR2L13,CCGGCATGGCCTACGACCGTTATTTCTCGAGAAATAACGGTCGTAGGCCATGTTTTTG,AATTCAAAAACATGGCCTACGACCGTTATTTCTCGAGAAATAACGGTCGTAGGCCATG,n/a
mouse,258989,Olfr457,NM_146987.1,TRCN0000188468,NM_146705.1-724s1c1,CACCTCACTGTAGTCTCCATA,pLKO.1,730,CDS,85,89,,,Y,258700,Olfr1451,CCGGCACCTCACTGTAGTCTCCATACTCGAGTATGGAGACTACAGTGAGGTGTTTTTG,AATTCAAAAACACCTCACTGTAGTCTCCATACTCGAGTATGGAGACTACAGTGAGGTG,n/a
mouse,258989,Olfr457,NM_146987.1,TRCN0000202883,NM_146816.1-190s1c1,CCCATGTATTATTTCCTCTTT,pLKO.1,172,CDS,85,89,,,Y,258812,Olfr923,CCGGCCCATGTATTATTTCCTCTTTCTCGAGAAAGAGGAAATAATACATGGGTTTTTG,AATTCAAAAACCCATGTATTATTTCCTCTTTCTCGAGAAAGAGGAAATAATACATGGG,n/a
mouse,258989,Olfr457,NM_146987.1,TRCN0000044319,NM_145068.2-443s1c1,GCACACTTCTTCCTGGAGATA,pLKO.1,247,CDS,85,89,,,Y,162514,TRPV3,CCGGGCACACTTCTTCCTGGAGATACTCGAGTATCTCCAGGAAGAAGTGTGCTTTTTG,AATTCAAAAAGCACACTTCTTCCTGGAGATACTCGAGTATCTCCAGGAAGAAGTGTGC,n/a
mouse,258989,Olfr457,NM_146987.1,TRCN0000357778,NM_013939.2-741s21c1,ACCTGTGCCTCTCACCTTATT,pLKO_005,718,CDS,85,89,,,Y,26538,OR10H2,CCGGACCTGTGCCTCTCACCTTATTCTCGAGAATAAGGTGAGAGGCACAGGTTTTTTG,AATTCAAAAAACCTGTGCCTCTCACCTTATTCTCGAGAATAAGGTGAGAGGCACAGGT,n/a
mouse,258989,Olfr457,NM_146987.1,TRCN0000030324,NM_146895.1-166s1c1,CCCATGTACTTCTTCCTATTT,pLKO.1,172,CDS,85,89,,,Y,258897,Olfr1201,CCGGCCCATGTACTTCTTCCTATTTCTCGAGAAATAGGAAGAAGTACATGGGTTTTTG,AATTCAAAAACCCATGTACTTCTTCCTATTTCTCGAGAAATAGGAAGAAGTACATGGG,n/a
mouse,258989,Olfr457,NM_146987.1,TRCN0000204647,NM_146739.1-358s1c1,GCCATGGCTTATGACCGATTT,pLKO.1,349,CDS,85,89,,,Y,258734,Olfr502,CCGGGCCATGGCTTATGACCGATTTCTCGAGAAATCGGTCATAAGCCATGGCTTTTTG,AATTCAAAAAGCCATGGCTTATGACCGATTTCTCGAGAAATCGGTCATAAGCCATGGC,n/a
mouse,258989,Olfr457,NM_146987.1,TRCN0000184920,XM_291862.3-191s1c1,CCATGTATTTCTTTCTCAGTA,pLKO.1,173,CDS,85,89,,,Y,338675,OR5AP2,CCGGCCATGTATTTCTTTCTCAGTACTCGAGTACTGAGAAAGAAATACATGGTTTTTG,AATTCAAAAACCATGTATTTCTTTCTCAGTACTCGAGTACTGAGAAAGAAATACATGG,n/a
mouse,258989,Olfr457,NM_146987.1,TRCN0000204737,NM_003552.1-117s1c1,GCTGGGAAATGTGCTCATCAT,pLKO.1,117,CDS,85,89,,,Y,653166,OR1D4,CCGGGCTGGGAAATGTGCTCATCATCTCGAGATGATGAGCACATTTCCCAGCTTTTTG,AATTCAAAAAGCTGGGAAATGTGCTCATCATCTCGAGATGATGAGCACATTTCCCAGC,n/a
mouse,258989,Olfr457,NM_146987.1,TRCN0000379190,NM_018815.2-5500s21c1,GGGACAGCAGTCACCATTATA,pLKO_005,475,CDS,80,89,,,Y,54563,Nup210,CCGGGGGACAGCAGTCACCATTATACTCGAGTATAATGGTGACTGCTGTCCCTTTTTG,AATTCAAAAAGGGACAGCAGTCACCATTATACTCGAGTATAATGGTGACTGCTGTCCC,n/a
mouse,258989,Olfr457,NM_146987.1,TRCN0000373605,NM_003018.3-517s21c1,GCTGCTACATCATGAAGATAG,pLKO_005,667,CDS,80,89,,,Y,6440,SFTPC,CCGGGCTGCTACATCATGAAGATAGCTCGAGCTATCTTCATGATGTAGCAGCTTTTTG,AATTCAAAAAGCTGCTACATCATGAAGATAGCTCGAGCTATCTTCATGATGTAGCAGC,n/a
mouse,258989,Olfr457,NM_146987.1,TRCN0000013767,NM_004405.2-30s1c1,TGATATGCACTCGACCCAGAT,pLKO.1,143,CDS,80,89,,,Y,1746,DLX2,CCGGTGATATGCACTCGACCCAGATCTCGAGATCTGGGTCGAGTGCATATCATTTTTG,AATTCAAAAATGATATGCACTCGACCCAGATCTCGAGATCTGGGTCGAGTGCATATCA,n/a
mouse,258989,Olfr457,NM_146987.1,TRCN0000434027,NM_152444.2-425s21c1,GACACTGGCACTGATTATATA,pLKO_005,540,CDS,80,89,,,Y,145482,PTGR2,CCGGGACACTGGCACTGATTATATACTCGAGTATATAATCAGTGCCAGTGTCTTTTTG,AATTCAAAAAGACACTGGCACTGATTATATACTCGAGTATATAATCAGTGCCAGTGTC,n/a
mouse,258989,Olfr457,NM_146987.1,TRCN0000443612,NM_207372.2-619s21c1,GAGTGACAAGCACATCCAATG,pLKO_005,54,CDS,80,89,,,Y,387694,SH2D4B,CCGGGAGTGACAAGCACATCCAATGCTCGAGCATTGGATGTGCTTGTCACTCTTTTTG,AATTCAAAAAGAGTGACAAGCACATCCAATGCTCGAGCATTGGATGTGCTTGTCACTC,n/a
mouse,258989,Olfr457,NM_146987.1,TRCN0000060371,NM_001004460.1-134s1c1,CCATGTACTTCTTCCTCAGAA,pLKO.1,173,CDS,80,89,,,Y,341276,OR10A2,CCGGCCATGTACTTCTTCCTCAGAACTCGAGTTCTGAGGAAGAAGTACATGGTTTTTG,AATTCAAAAACCATGTACTTCTTCCTCAGAACTCGAGTTCTGAGGAAGAAGTACATGG,n/a
mouse,258989,Olfr457,NM_146987.1,TRCN0000188297,NM_146280.1-170s1c1,CGCCCATGTACTTCTTCCTAA,pLKO.1,170,CDS,80,89,,,Y,258277,Olfr281,CCGGCGCCCATGTACTTCTTCCTAACTCGAGTTAGGAAGAAGTACATGGGCGTTTTTG,AATTCAAAAACGCCCATGTACTTCTTCCTAACTCGAGTTAGGAAGAAGTACATGGGCG,n/a
mouse,258989,Olfr457,NM_146987.1,TRCN0000188492,NM_001011769.1-172s1c1,CCCATGTACTTCTTCCTCACA,pLKO.1,172,CDS,80,89,,,Y,257931,Olfr317,CCGGCCCATGTACTTCTTCCTCACACTCGAGTGTGAGGAAGAAGTACATGGGTTTTTG,AATTCAAAAACCCATGTACTTCTTCCTCACACTCGAGTGTGAGGAAGAAGTACATGGG,n/a
mouse,258989,Olfr457,NM_146987.1,TRCN0000004715,NM_001506.1-126s1c1,CCGCCCACTGACTGTGGTTAT,pLKO.1,725,CDS,77,85,,,Y,2854,GPR32,CCGGCCGCCCACTGACTGTGGTTATCTCGAGATAACCACAGTCAGTGGGCGGTTTTTG,AATTCAAAAACCGCCCACTGACTGTGGTTATCTCGAGATAACCACAGTCAGTGGGCGG,n/a
