Taxon,"Gene ID","Gene Symbol",Transcript,"Clone ID","Legacy Clone Name","Target Seq",Vector,"Match Position","Match Region","Match %","SDR Match %","Intrinsic Score","Adjusted Score","Matches Other Gene in Same Taxon?","Orig. Target Gene ID","Orig. Target Gene Symbol","Forward Oligo Sequence","Reverse Oligo Sequence",Addgene
mouse,259063,Olfr691,NM_147061.1,TRCN0000185262,NM_147061.1-563s1c1,GCTTAGCTTGTGCAGATATAA,pLKO.1,563,CDS,100,100,15,10.5,N,259063,Olfr691,CCGGGCTTAGCTTGTGCAGATATAACTCGAGTTATATCTGCACAAGCTAAGCTTTTTG,AATTCAAAAAGCTTAGCTTGTGCAGATATAACTCGAGTTATATCTGCACAAGCTAAGC,n/a
mouse,259063,Olfr691,NM_147061.1,TRCN0000185579,NM_147061.1-465s1c1,CTGTATTATCTTTCCTGTGAT,pLKO.1,465,CDS,100,100,4.95,3.465,N,259063,Olfr691,CCGGCTGTATTATCTTTCCTGTGATCTCGAGATCACAGGAAAGATAATACAGTTTTTG,AATTCAAAAACTGTATTATCTTTCCTGTGATCTCGAGATCACAGGAAAGATAATACAG,n/a
mouse,259063,Olfr691,NM_147061.1,TRCN0000185223,NM_147061.1-569s1c1,CTTGTGCAGATATAACTGTTA,pLKO.1,569,CDS,100,100,4.95,3.465,N,259063,Olfr691,CCGGCTTGTGCAGATATAACTGTTACTCGAGTAACAGTTATATCTGCACAAGTTTTTG,AATTCAAAAACTTGTGCAGATATAACTGTTACTCGAGTAACAGTTATATCTGCACAAG,n/a
mouse,259063,Olfr691,NM_147061.1,TRCN0000187163,NM_147061.1-390s1c1,CCCACTGAGATATGCAACAGT,pLKO.1,390,CDS,100,100,3,2.1,N,259063,Olfr691,CCGGCCCACTGAGATATGCAACAGTCTCGAGACTGTTGCATATCTCAGTGGGTTTTTG,AATTCAAAAACCCACTGAGATATGCAACAGTCTCGAGACTGTTGCATATCTCAGTGGG,n/a
mouse,259063,Olfr691,NM_147061.1,TRCN0000202642,NM_147061.1-627s1c1,CATTGTGGATGTGATTCTCAT,pLKO.1,627,CDS,100,100,4.95,2.97,N,259063,Olfr691,CCGGCATTGTGGATGTGATTCTCATCTCGAGATGAGAATCACATCCACAATGTTTTTG,AATTCAAAAACATTGTGGATGTGATTCTCATCTCGAGATGAGAATCACATCCACAATG,n/a
mouse,259063,Olfr691,NM_147061.1,TRCN0000204443,XM_061611.2-531s1c1,CCATTCCTACTGTGAGCACAT,pLKO.1,531,CDS,100,100,4.05,2.025,Y,119679,OR52J3,CCGGCCATTCCTACTGTGAGCACATCTCGAGATGTGCTCACAGTAGGAATGGTTTTTG,AATTCAAAAACCATTCCTACTGTGAGCACATCTCGAGATGTGCTCACAGTAGGAATGG,n/a
mouse,259063,Olfr691,NM_147061.1,TRCN0000063274,XM_171528.1-302s1c1,CCCAAGGCTTCTTTGTCCATA,pLKO.1,302,CDS,90,95,,,N,255725,OR52B2,CCGGCCCAAGGCTTCTTTGTCCATACTCGAGTATGGACAAAGAAGCCTTGGGTTTTTG,AATTCAAAAACCCAAGGCTTCTTTGTCCATACTCGAGTATGGACAAAGAAGCCTTGGG,n/a
mouse,259063,Olfr691,NM_147061.1,TRCN0000376432,NM_003375.2-1025s21c1,CCCTGGAGTTGGAGGCTTAAT,pLKO_005,57,CDS,85,95,,,N,7417,VDAC2,CCGGCCCTGGAGTTGGAGGCTTAATCTCGAGATTAAGCCTCCAACTCCAGGGTTTTTG,AATTCAAAAACCCTGGAGTTGGAGGCTTAATCTCGAGATTAAGCCTCCAACTCCAGGG,n/a
mouse,259063,Olfr691,NM_147061.1,TRCN0000202883,NM_146816.1-190s1c1,CCCATGTATTATTTCCTCTTT,pLKO.1,178,CDS,85,95,,,Y,258812,Olfr923,CCGGCCCATGTATTATTTCCTCTTTCTCGAGAAAGAGGAAATAATACATGGGTTTTTG,AATTCAAAAACCCATGTATTATTTCCTCTTTCTCGAGAAAGAGGAAATAATACATGGG,n/a
mouse,259063,Olfr691,NM_147061.1,TRCN0000203340,NM_146987.1-172s1c1,CCCATGTATTTCTTCCTCTGT,pLKO.1,178,CDS,85,95,,,Y,258989,Olfr457,CCGGCCCATGTATTTCTTCCTCTGTCTCGAGACAGAGGAAGAAATACATGGGTTTTTG,AATTCAAAAACCCATGTATTTCTTCCTCTGTCTCGAGACAGAGGAAGAAATACATGGG,n/a
mouse,259063,Olfr691,NM_147061.1,TRCN0000220204,NM_199290.2-106s1c2,CAGCATCTGATAGTGGTGAAT,pLKO.1,132,CDS,81,90,,,N,342538,NACA2,CCGGCAGCATCTGATAGTGGTGAATCTCGAGATTCACCACTATCAGATGCTGTTTTTG,AATTCAAAAACAGCATCTGATAGTGGTGAATCTCGAGATTCACCACTATCAGATGCTG,n/a
mouse,259063,Olfr691,NM_147061.1,TRCN0000175552,NM_001005420.1-4329s1c1,CCGCTTTGCTTGTGAAGATAT,pLKO.1,561,CDS,90,89,,,Y,241289,Ppp1r26,CCGGCCGCTTTGCTTGTGAAGATATCTCGAGATATCTTCACAAGCAAAGCGGTTTTTG,AATTCAAAAACCGCTTTGCTTGTGAAGATATCTCGAGATATCTTCACAAGCAAAGCGG,n/a
mouse,259063,Olfr691,NM_147061.1,TRCN0000203722,XM_372347.1-531s1c1,CCATTGCTACTGTGAACACAT,pLKO.1,531,CDS,90,89,,,Y,390036,OR52K1,CCGGCCATTGCTACTGTGAACACATCTCGAGATGTGTTCACAGTAGCAATGGTTTTTG,AATTCAAAAACCATTGCTACTGTGAACACATCTCGAGATGTGTTCACAGTAGCAATGG,n/a
mouse,259063,Olfr691,NM_147061.1,TRCN0000197354,NM_147053.1-546s1c2,CCAGTCTTACTGTGAGCACAT,pLKO.1,531,CDS,90,89,,,Y,259055,Olfr582,CCGGCCAGTCTTACTGTGAGCACATCTCGAGATGTGCTCACAGTAAGACTGGTTTTTG,AATTCAAAAACCAGTCTTACTGTGAGCACATCTCGAGATGTGCTCACAGTAAGACTGG,n/a
mouse,259063,Olfr691,NM_147061.1,TRCN0000063275,XM_171528.1-735s1c1,CCACCTCTGTGTCATCCTTAT,pLKO.1,735,CDS,90,89,,,Y,255725,OR52B2,CCGGCCACCTCTGTGTCATCCTTATCTCGAGATAAGGATGACACAGAGGTGGTTTTTG,AATTCAAAAACCACCTCTGTGTCATCCTTATCTCGAGATAAGGATGACACAGAGGTGG,n/a
mouse,259063,Olfr691,NM_147061.1,TRCN0000204285,XM_372348.1-537s1c1,CCACTCCTACTGTAAGCACAT,pLKO.1,531,CDS,90,89,,,Y,390037,OR52I1,CCGGCCACTCCTACTGTAAGCACATCTCGAGATGTGCTTACAGTAGGAGTGGTTTTTG,AATTCAAAAACCACTCCTACTGTAAGCACATCTCGAGATGTGCTTACAGTAGGAGTGG,n/a
mouse,259063,Olfr691,NM_147061.1,TRCN0000204247,NM_001011527.1-537s1c1,CCATACCTACTGTGACCACAT,pLKO.1,531,CDS,90,89,,,Y,259143,Olfr503,CCGGCCATACCTACTGTGACCACATCTCGAGATGTGGTCACAGTAGGTATGGTTTTTG,AATTCAAAAACCATACCTACTGTGACCACATCTCGAGATGTGGTCACAGTAGGTATGG,n/a
mouse,259063,Olfr691,NM_147061.1,TRCN0000256267,NM_001040071.1-317s21c1,ACCTCTGTGTCTTCTTCATTT,pLKO_005,737,CDS,85,89,,,Y,650293,LOC650293,CCGGACCTCTGTGTCTTCTTCATTTCTCGAGAAATGAAGAAGACACAGAGGTTTTTTG,AATTCAAAAAACCTCTGTGTCTTCTTCATTTCTCGAGAAATGAAGAAGACACAGAGGT,n/a
mouse,259063,Olfr691,NM_147061.1,TRCN0000184890,NM_146359.1-179s1c1,CCATGTGTTATTTCCTCTCTA,pLKO.1,179,CDS,85,89,,,Y,258356,Olfr564,CCGGCCATGTGTTATTTCCTCTCTACTCGAGTAGAGAGGAAATAACACATGGTTTTTG,AATTCAAAAACCATGTGTTATTTCCTCTCTACTCGAGTAGAGAGGAAATAACACATGG,n/a
mouse,259063,Olfr691,NM_147061.1,TRCN0000204779,NM_001005224.1-349s1c1,GCCATGGCCTTTGACAGATAT,pLKO.1,355,CDS,85,89,,,Y,26683,OR4F3,CCGGGCCATGGCCTTTGACAGATATCTCGAGATATCTGTCAAAGGCCATGGCTTTTTG,AATTCAAAAAGCCATGGCCTTTGACAGATATCTCGAGATATCTGTCAAAGGCCATGGC,n/a
mouse,259063,Olfr691,NM_147061.1,TRCN0000304114,NM_005110.2-1862s21c1,GCCCGTCATCATGGTCATTAT,pLKO_005,612,CDS,85,89,,,Y,9945,GFPT2,CCGGGCCCGTCATCATGGTCATTATCTCGAGATAATGACCATGATGACGGGCTTTTTG,AATTCAAAAAGCCCGTCATCATGGTCATTATCTCGAGATAATGACCATGATGACGGGC,n/a
mouse,259063,Olfr691,NM_147061.1,TRCN0000583868,,GCCATGGCCTATGACCGATAT,pLKO_005,355,CDS,85,89,,,Y,343173,OR2T3,CCGGGCCATGGCCTATGACCGATATCTCGAGATATCGGTCATAGGCCATGGCTTTTTG,AATTCAAAAAGCCATGGCCTATGACCGATATCTCGAGATATCGGTCATAGGCCATGGC,n/a
mouse,259063,Olfr691,NM_147061.1,TRCN0000188938,NM_147120.1-373s1c1,GCCATGTCCTTTGACCGTTAT,pLKO.1,355,CDS,85,89,,,Y,259124,Olfr638,CCGGGCCATGTCCTTTGACCGTTATCTCGAGATAACGGTCAAAGGACATGGCTTTTTG,AATTCAAAAAGCCATGTCCTTTGACCGTTATCTCGAGATAACGGTCAAAGGACATGGC,n/a
mouse,259063,Olfr691,NM_147061.1,TRCN0000063277,XM_171528.1-619s1c1,GTCATGGTCATCTTGGATGTT,pLKO.1,619,CDS,85,89,,,Y,255725,OR52B2,CCGGGTCATGGTCATCTTGGATGTTCTCGAGAACATCCAAGATGACCATGACTTTTTG,AATTCAAAAAGTCATGGTCATCTTGGATGTTCTCGAGAACATCCAAGATGACCATGAC,n/a
mouse,259063,Olfr691,NM_147061.1,TRCN0000196275,NM_015092.3-13998s1c1,GCTTAGCTTGTGTAGTTATTT,pLKO.1,563,CDS,80,89,,,N,23049,SMG1,CCGGGCTTAGCTTGTGTAGTTATTTCTCGAGAAATAACTACACAAGCTAAGCTTTTTG,AATTCAAAAAGCTTAGCTTGTGTAGTTATTTCTCGAGAAATAACTACACAAGCTAAGC,n/a
mouse,259063,Olfr691,NM_147061.1,TRCN0000121228,NM_005433.3-466s1c1,CAAGTTCATATCCTGCTGGTT,pLKO.1,817,CDS,80,89,,,N,7525,YES1,CCGGCAAGTTCATATCCTGCTGGTTCTCGAGAACCAGCAGGATATGAACTTGTTTTTG,AATTCAAAAACAAGTTCATATCCTGCTGGTTCTCGAGAACCAGCAGGATATGAACTTG,n/a
mouse,259063,Olfr691,NM_147061.1,TRCN0000098893,NM_023530.2-556s1c1,CCTGTGATTCTCTGGCTGATA,pLKO.1,478,CDS,80,89,,,Y,69836,Pla2g12b,CCGGCCTGTGATTCTCTGGCTGATACTCGAGTATCAGCCAGAGAATCACAGGTTTTTG,AATTCAAAAACCTGTGATTCTCTGGCTGATACTCGAGTATCAGCCAGAGAATCACAGG,n/a
mouse,259063,Olfr691,NM_147061.1,TRCN0000028987,NM_010980.1-163s1c1,CCCATGTATTTCTTCCTCAAT,pLKO.1,178,CDS,80,89,,,Y,18331,Olfr32,CCGGCCCATGTATTTCTTCCTCAATCTCGAGATTGAGGAAGAAATACATGGGTTTTTG,AATTCAAAAACCCATGTATTTCTTCCTCAATCTCGAGATTGAGGAAGAAATACATGGG,n/a
mouse,259063,Olfr691,NM_147061.1,TRCN0000186115,NM_146345.1-184s1c1,CCCATGTATTTCTTCCTCAGT,pLKO.1,178,CDS,80,89,,,Y,258342,Olfr1491,CCGGCCCATGTATTTCTTCCTCAGTCTCGAGACTGAGGAAGAAATACATGGGTTTTTG,AATTCAAAAACCCATGTATTTCTTCCTCAGTCTCGAGACTGAGGAAGAAATACATGGG,n/a
mouse,259063,Olfr691,NM_147061.1,TRCN0000370732,NM_001039547.1-718s21c1,TTGATACCTGGTTGTTATATA,pLKO_005,74,CDS,77,85,,,Y,256356,GK5,CCGGTTGATACCTGGTTGTTATATACTCGAGTATATAACAACCAGGTATCAATTTTTG,AATTCAAAAATTGATACCTGGTTGTTATATACTCGAGTATATAACAACCAGGTATCAA,n/a
