Taxon,"Gene ID","Gene Symbol",Transcript,"Clone ID","Legacy Clone Name","Target Seq",Vector,"Match Position","Match Region","Match %","SDR Match %","Intrinsic Score","Adjusted Score","Matches Other Gene in Same Taxon?","Orig. Target Gene ID","Orig. Target Gene Symbol","Forward Oligo Sequence","Reverse Oligo Sequence",Addgene
human,54581,SCAND2P,NR_003654.2,TRCN0000021791,NM_022050.2-471s1c1,CTCCAAATAGTTAAACTGGAA,pLKO.1,489,3UTR,100,100,2.64,3.696,N,54581,SCAND2P,CCGGCTCCAAATAGTTAAACTGGAACTCGAGTTCCAGTTTAACTATTTGGAGTTTTTG,AATTCAAAAACTCCAAATAGTTAAACTGGAACTCGAGTTCCAGTTTAACTATTTGGAG,n/a
human,54581,SCAND2P,NR_003654.2,TRCN0000021790,NM_022050.2-777s1c1,CTGGTGGAAGACTTGCAGAAA,pLKO.1,795,3UTR,100,100,4.95,3.465,N,54581,SCAND2P,CCGGCTGGTGGAAGACTTGCAGAAACTCGAGTTTCTGCAAGTCTTCCACCAGTTTTTG,AATTCAAAAACTGGTGGAAGACTTGCAGAAACTCGAGTTTCTGCAAGTCTTCCACCAG,n/a
human,54581,SCAND2P,NR_003654.2,TRCN0000021792,NM_022050.2-625s1c1,AGCTCTGTTGTCAGTGGCTAA,pLKO.1,643,3UTR,100,100,4.05,2.43,N,54581,SCAND2P,CCGGAGCTCTGTTGTCAGTGGCTAACTCGAGTTAGCCACTGACAACAGAGCTTTTTTG,AATTCAAAAAAGCTCTGTTGTCAGTGGCTAACTCGAGTTAGCCACTGACAACAGAGCT,n/a
human,54581,SCAND2P,NR_003654.2,TRCN0000165027,NM_001013636.1-513s1c1,GAACTCCTGACCTCAAGTGAT,pLKO.1,3225,3UTR,100,100,4.95,2.475,Y,387873,LOC387873,CCGGGAACTCCTGACCTCAAGTGATCTCGAGATCACTTGAGGTCAGGAGTTCTTTTTG,AATTCAAAAAGAACTCCTGACCTCAAGTGATCTCGAGATCACTTGAGGTCAGGAGTTC,n/a
human,54581,SCAND2P,NR_003654.2,TRCN0000164801,NM_016534.2-1646s1c1,CCTCCCAAAGTACTGGGATTA,pLKO.1,3443,3UTR,100,100,1.08,.54,Y,51275,MAPKAPK5-AS1,CCGGCCTCCCAAAGTACTGGGATTACTCGAGTAATCCCAGTACTTTGGGAGGTTTTTG,AATTCAAAAACCTCCCAAAGTACTGGGATTACTCGAGTAATCCCAGTACTTTGGGAGG,n/a
human,54581,SCAND2P,NR_003654.2,TRCN0000140610,NM_025042.2-931s1c1,GCCTCTCAGGTTCAAGCAATT,pLKO.1,3088,3UTR,95,95,,,Y,,,CCGGGCCTCTCAGGTTCAAGCAATTCTCGAGAATTGCTTGAACCTGAGAGGCTTTTTG,AATTCAAAAAGCCTCTCAGGTTCAAGCAATTCTCGAGAATTGCTTGAACCTGAGAGGC,n/a
human,54581,SCAND2P,NR_003654.2,TRCN0000163829,NM_173639.1-1102s1c1,CCTCCCAAATTACTGGGATTA,pLKO.1,3443,3UTR,95,95,,,Y,284618,RUSC1-AS1,CCGGCCTCCCAAATTACTGGGATTACTCGAGTAATCCCAGTAATTTGGGAGGTTTTTG,AATTCAAAAACCTCCCAAATTACTGGGATTACTCGAGTAATCCCAGTAATTTGGGAGG,n/a
human,54581,SCAND2P,NR_003654.2,TRCN0000140374,NM_025042.2-1098s1c1,GCTTCCCAAAGTACTGGGATT,pLKO.1,3442,3UTR,95,95,,,Y,,,CCGGGCTTCCCAAAGTACTGGGATTCTCGAGAATCCCAGTACTTTGGGAAGCTTTTTG,AATTCAAAAAGCTTCCCAAAGTACTGGGATTCTCGAGAATCCCAGTACTTTGGGAAGC,n/a
human,54581,SCAND2P,NR_003654.2,TRCN0000091448,NM_013513.1-2495s1c1,CCTCCCAAGTACTGGGATTAA,pLKO.1,3443,3UTR,90,95,,,Y,13828,Epb42,CCGGCCTCCCAAGTACTGGGATTAACTCGAGTTAATCCCAGTACTTGGGAGGTTTTTG,AATTCAAAAACCTCCCAAGTACTGGGATTAACTCGAGTTAATCCCAGTACTTGGGAGG,n/a
human,54581,SCAND2P,NR_003654.2,TRCN0000245890,NM_001007530.1-215s21c1,CTGTCCTTGTCCAGGAGATTC,pLKO_005,724,3UTR,90,95,,,Y,146822,CDRT15,CCGGCTGTCCTTGTCCAGGAGATTCCTCGAGGAATCTCCTGGACAAGGACAGTTTTTG,AATTCAAAAACTGTCCTTGTCCAGGAGATTCCTCGAGGAATCTCCTGGACAAGGACAG,n/a
human,54581,SCAND2P,NR_003654.2,TRCN0000045549,NM_016234.3-398s1c1,CCTCTTCTTGACCTGAACAAT,pLKO.1,421,3UTR,90,90,,,Y,51703,ACSL5,CCGGCCTCTTCTTGACCTGAACAATCTCGAGATTGTTCAGGTCAAGAAGAGGTTTTTG,AATTCAAAAACCTCTTCTTGACCTGAACAATCTCGAGATTGTTCAGGTCAAGAAGAGG,n/a
human,54581,SCAND2P,NR_003654.2,TRCN0000172468,NM_178520.2-2286s1c1,CCTCTCAAAGCACTGGGATTA,pLKO.1,3443,3UTR,90,89,,,Y,284186,TMEM105,CCGGCCTCTCAAAGCACTGGGATTACTCGAGTAATCCCAGTGCTTTGAGAGGTTTTTG,AATTCAAAAACCTCTCAAAGCACTGGGATTACTCGAGTAATCCCAGTGCTTTGAGAGG,n/a
human,54581,SCAND2P,NR_003654.2,TRCN0000172710,NM_032937.2-575s1c1,GAACTCCTGACCTCAAGCAAT,pLKO.1,3225,3UTR,90,89,,,Y,85026,ARRDC1-AS1,CCGGGAACTCCTGACCTCAAGCAATCTCGAGATTGCTTGAGGTCAGGAGTTCTTTTTG,AATTCAAAAAGAACTCCTGACCTCAAGCAATCTCGAGATTGCTTGAGGTCAGGAGTTC,n/a
human,54581,SCAND2P,NR_003654.2,TRCN0000158698,NM_175856.3-1552s1c1,GACTTCAAGGAAATTCAGTAT,pLKO.1,2717,3UTR,85,89,,,Y,337876,CHSY3,CCGGGACTTCAAGGAAATTCAGTATCTCGAGATACTGAATTTCCTTGAAGTCTTTTTG,AATTCAAAAAGACTTCAAGGAAATTCAGTATCTCGAGATACTGAATTTCCTTGAAGTC,n/a
human,54581,SCAND2P,NR_003654.2,TRCN0000110856,NM_144808.3-1440s1c1,GCAGGCTCTCTTCTTCAACTT,pLKO.1,230,3UTR,85,89,,,Y,213053,Slc39a14,CCGGGCAGGCTCTCTTCTTCAACTTCTCGAGAAGTTGAAGAAGAGAGCCTGCTTTTTG,AATTCAAAAAGCAGGCTCTCTTCTTCAACTTCTCGAGAAGTTGAAGAAGAGAGCCTGC,n/a
human,54581,SCAND2P,NR_003654.2,TRCN0000325460,NM_144808.4-1437s21c1,GCAGGCTCTCTTCTTCAACTT,pLKO_005,230,3UTR,85,89,,,Y,213053,Slc39a14,CCGGGCAGGCTCTCTTCTTCAACTTCTCGAGAAGTTGAAGAAGAGAGCCTGCTTTTTG,AATTCAAAAAGCAGGCTCTCTTCTTCAACTTCTCGAGAAGTTGAAGAAGAGAGCCTGC,n/a
human,54581,SCAND2P,NR_003654.2,TRCN0000115673,NM_005425.4-356s1c1,CAGAAAGAACTTGGAAGGCAA,pLKO.1,810,3UTR,85,89,,,Y,7142,TNP2,CCGGCAGAAAGAACTTGGAAGGCAACTCGAGTTGCCTTCCAAGTTCTTTCTGTTTTTG,AATTCAAAAACAGAAAGAACTTGGAAGGCAACTCGAGTTGCCTTCCAAGTTCTTTCTG,n/a
human,54581,SCAND2P,NR_003654.2,TRCN0000026569,NM_138412.2-1503s1c1,CCTGGGAATCTAAACTGGGAA,pLKO.1,2794,3UTR,85,89,,,Y,112724,RDH13,CCGGCCTGGGAATCTAAACTGGGAACTCGAGTTCCCAGTTTAGATTCCCAGGTTTTTG,AATTCAAAAACCTGGGAATCTAAACTGGGAACTCGAGTTCCCAGTTTAGATTCCCAGG,n/a
human,54581,SCAND2P,NR_003654.2,TRCN0000379755,NM_031945.3-761s21c1,ACCTGTACTTTAACTGCAGCT,pLKO_005,3485,3UTR,85,89,,,Y,83882,TSPAN10,CCGGACCTGTACTTTAACTGCAGCTCTCGAGAGCTGCAGTTAAAGTACAGGTTTTTTG,AATTCAAAAAACCTGTACTTTAACTGCAGCTCTCGAGAGCTGCAGTTAAAGTACAGGT,n/a
human,54581,SCAND2P,NR_003654.2,TRCN0000329696,NM_001675.2-1169s21c1,TGGATGCCCTGTTGGGTATAG,pLKO_005,1452,3UTR,85,89,,,Y,468,ATF4,CCGGTGGATGCCCTGTTGGGTATAGCTCGAGCTATACCCAACAGGGCATCCATTTTTG,AATTCAAAAATGGATGCCCTGTTGGGTATAGCTCGAGCTATACCCAACAGGGCATCCA,n/a
human,54581,SCAND2P,NR_003654.2,TRCN0000294918,NM_025579.3-233s21c1,CTCCAGTTTCTCATCTGTAAA,pLKO_005,2321,3UTR,85,89,,,Y,66464,Taf12,CCGGCTCCAGTTTCTCATCTGTAAACTCGAGTTTACAGATGAGAAACTGGAGTTTTTG,AATTCAAAAACTCCAGTTTCTCATCTGTAAACTCGAGTTTACAGATGAGAAACTGGAG,n/a
human,54581,SCAND2P,NR_003654.2,TRCN0000149052,NM_017802.2-2631s1c1,GCCAGAGTTTGTGGCATTTAA,pLKO.1,574,3UTR,80,89,,,Y,54919,DNAAF5,CCGGGCCAGAGTTTGTGGCATTTAACTCGAGTTAAATGCCACAAACTCTGGCTTTTTG,AATTCAAAAAGCCAGAGTTTGTGGCATTTAACTCGAGTTAAATGCCACAAACTCTGGC,n/a
human,54581,SCAND2P,NR_003654.2,TRCN0000232785,NM_005072.3-1430s21c1,GGACCATTCTGGCCATCATTA,pLKO_005,3627,3UTR,80,89,,,Y,6560,SLC12A4,CCGGGGACCATTCTGGCCATCATTACTCGAGTAATGATGGCCAGAATGGTCCTTTTTG,AATTCAAAAAGGACCATTCTGGCCATCATTACTCGAGTAATGATGGCCAGAATGGTCC,n/a
human,54581,SCAND2P,NR_003654.2,TRCN0000381834,NM_138453.2-159s21c1,ACTCCTCTGATCAGAACTTTG,pLKO_005,150,3UTR,80,89,,,Y,115827,RAB3C,CCGGACTCCTCTGATCAGAACTTTGCTCGAGCAAAGTTCTGATCAGAGGAGTTTTTTG,AATTCAAAAAACTCCTCTGATCAGAACTTTGCTCGAGCAAAGTTCTGATCAGAGGAGT,n/a
human,54581,SCAND2P,NR_003654.2,TRCN0000381012,NM_011227.1-450s21c1,AGAGGATGCAGTGGCCCTTTA,pLKO_005,779,3UTR,80,89,,,Y,19332,Rab20,CCGGAGAGGATGCAGTGGCCCTTTACTCGAGTAAAGGGCCACTGCATCCTCTTTTTTG,AATTCAAAAAAGAGGATGCAGTGGCCCTTTACTCGAGTAAAGGGCCACTGCATCCTCT,n/a
human,54581,SCAND2P,NR_003654.2,TRCN0000421105,NM_005261.3-502s21c1,AGTCCACTCTGGCCAACATCT,pLKO_005,3627,3UTR,80,89,,,Y,2669,GEM,CCGGAGTCCACTCTGGCCAACATCTCTCGAGAGATGTTGGCCAGAGTGGACTTTTTTG,AATTCAAAAAAGTCCACTCTGGCCAACATCTCTCGAGAGATGTTGGCCAGAGTGGACT,n/a
human,54581,SCAND2P,NR_003654.2,TRCN0000019907,NM_153608.1-989s1c1,CACCTCCAGAAATAACTCAAT,pLKO.1,950,3UTR,80,89,,,Y,163071,ZNF114,CCGGCACCTCCAGAAATAACTCAATCTCGAGATTGAGTTATTTCTGGAGGTGTTTTTG,AATTCAAAAACACCTCCAGAAATAACTCAATCTCGAGATTGAGTTATTTCTGGAGGTG,n/a
human,54581,SCAND2P,NR_003654.2,TRCN0000110312,NM_025952.2-215s1c1,CCACCGAGAAATTACTCAGTT,pLKO.1,949,3UTR,80,89,,,Y,67075,Magt1,CCGGCCACCGAGAAATTACTCAGTTCTCGAGAACTGAGTAATTTCTCGGTGGTTTTTG,AATTCAAAAACCACCGAGAAATTACTCAGTTCTCGAGAACTGAGTAATTTCTCGGTGG,n/a
human,54581,SCAND2P,NR_003654.2,TRCN0000331856,NM_025952.3-225s21c1,CCACCGAGAAATTACTCAGTT,pLKO_005,949,3UTR,80,89,,,Y,67075,Magt1,CCGGCCACCGAGAAATTACTCAGTTCTCGAGAACTGAGTAATTTCTCGGTGGTTTTTG,AATTCAAAAACCACCGAGAAATTACTCAGTTCTCGAGAACTGAGTAATTTCTCGGTGG,n/a
human,54581,SCAND2P,NR_003654.2,TRCN0000200088,NM_053073.1-2009s1c1,CAATGGAATCACCCTGGACTT,pLKO.1,543,3UTR,80,89,,,Y,16975,Lrp8,CCGGCAATGGAATCACCCTGGACTTCTCGAGAAGTCCAGGGTGATTCCATTGTTTTTG,AATTCAAAAACAATGGAATCACCCTGGACTTCTCGAGAAGTCCAGGGTGATTCCATTG,n/a
human,54581,SCAND2P,NR_003654.2,TRCN0000141447,NM_138412.2-1504s1c1,CTGGGAATCTAAACTGGGAAT,pLKO.1,2795,3UTR,80,89,,,Y,112724,RDH13,CCGGCTGGGAATCTAAACTGGGAATCTCGAGATTCCCAGTTTAGATTCCCAGTTTTTG,AATTCAAAAACTGGGAATCTAAACTGGGAATCTCGAGATTCCCAGTTTAGATTCCCAG,n/a
human,54581,SCAND2P,NR_003654.2,TRCN0000270539,NM_001029930.1-1564s21c1,TTTCTTCTGAGCTGGACTTAA,pLKO_005,2630,3UTR,80,89,,,Y,545007,Gm5796,CCGGTTTCTTCTGAGCTGGACTTAACTCGAGTTAAGTCCAGCTCAGAAGAAATTTTTG,AATTCAAAAATTTCTTCTGAGCTGGACTTAACTCGAGTTAAGTCCAGCTCAGAAGAAA,n/a
human,54581,SCAND2P,NR_003654.2,TRCN0000049097,XM_209423.3-340s1c1,CGAGACCCAGACGCGCTGAAA,pLKO.1,2170,3UTR,86,85,,,Y,284964,LOC284964,CCGGCGAGACCCAGACGCGCTGAAACTCGAGTTTCAGCGCGTCTGGGTCTCGTTTTTG,AATTCAAAAACGAGACCCAGACGCGCTGAAACTCGAGTTTCAGCGCGTCTGGGTCTCG,n/a
human,54581,SCAND2P,NR_003654.2,TRCN0000061659,NM_006138.3-528s1c1,GCAGTTAATATCCAGTCATTA,pLKO.1,1992,3UTR,81,85,,,Y,932,MS4A3,CCGGGCAGTTAATATCCAGTCATTACTCGAGTAATGACTGGATATTAACTGCTTTTTG,AATTCAAAAAGCAGTTAATATCCAGTCATTACTCGAGTAATGACTGGATATTAACTGC,n/a
human,54581,SCAND2P,NR_003654.2,TRCN0000118169,NM_144587.2-1401s1c1,CTGCTCTTTAACCAGGAGAAT,pLKO.1,1920,3UTR,81,85,,,Y,118663,BTBD16,CCGGCTGCTCTTTAACCAGGAGAATCTCGAGATTCTCCTGGTTAAAGAGCAGTTTTTG,AATTCAAAAACTGCTCTTTAACCAGGAGAATCTCGAGATTCTCCTGGTTAAAGAGCAG,n/a
human,54581,SCAND2P,NR_003654.2,TRCN0000082265,NM_028085.1-183s1c1,CCCTAGAAATAATCTGCAGTA,pLKO.1,951,3UTR,81,85,,,Y,72074,Anks4b,CCGGCCCTAGAAATAATCTGCAGTACTCGAGTACTGCAGATTATTTCTAGGGTTTTTG,AATTCAAAAACCCTAGAAATAATCTGCAGTACTCGAGTACTGCAGATTATTTCTAGGG,n/a
human,54581,SCAND2P,NR_003654.2,TRCN0000050962,NM_006290.2-2104s1c1,GAAGCTCAGAATCAGAGATTT,pLKO.1,1719,3UTR,81,85,,,Y,7128,TNFAIP3,CCGGGAAGCTCAGAATCAGAGATTTCTCGAGAAATCTCTGATTCTGAGCTTCTTTTTG,AATTCAAAAAGAAGCTCAGAATCAGAGATTTCTCGAGAAATCTCTGATTCTGAGCTTC,n/a
human,54581,SCAND2P,NR_003654.2,TRCN0000031686,NM_144930.1-1148s1c1,CCTGGAGCAATTTGCTTCCAT,pLKO.1,1354,3UTR,77,85,,,Y,234564,Ces1f,CCGGCCTGGAGCAATTTGCTTCCATCTCGAGATGGAAGCAAATTGCTCCAGGTTTTTG,AATTCAAAAACCTGGAGCAATTTGCTTCCATCTCGAGATGGAAGCAAATTGCTCCAGG,n/a
human,54581,SCAND2P,NR_003654.2,TRCN0000081891,NM_009296.1-350s1c1,AGTGGCCTACAAATCCAGAGA,pLKO.1,452,3UTR,77,85,,,Y,20922,Supt4a,CCGGAGTGGCCTACAAATCCAGAGACTCGAGTCTCTGGATTTGTAGGCCACTTTTTTG,AATTCAAAAAAGTGGCCTACAAATCCAGAGACTCGAGTCTCTGGATTTGTAGGCCACT,n/a
human,54581,SCAND2P,NR_003654.2,TRCN0000235894,NM_017757.2-1296s21c1,GCCAAGACCTGAGCGAAATAT,pLKO_005,1153,3UTR,77,85,,,Y,55628,ZNF407,CCGGGCCAAGACCTGAGCGAAATATCTCGAGATATTTCGCTCAGGTCTTGGCTTTTTG,AATTCAAAAAGCCAAGACCTGAGCGAAATATCTCGAGATATTTCGCTCAGGTCTTGGC,n/a
human,54581,SCAND2P,NR_003654.2,TRCN0000193833,NM_031249.1-367s1c1,CAAGGAGGAGTTAAAGAGCTT,pLKO.1,1985,3UTR,77,85,,,Y,83410,Cstf2t,CCGGCAAGGAGGAGTTAAAGAGCTTCTCGAGAAGCTCTTTAACTCCTCCTTGTTTTTG,AATTCAAAAACAAGGAGGAGTTAAAGAGCTTCTCGAGAAGCTCTTTAACTCCTCCTTG,n/a
