Taxon,"Gene ID","Gene Symbol",Transcript,"Clone ID","Legacy Clone Name","Target Seq",Vector,"Match Position","Match Region","Match %","SDR Match %","Intrinsic Score","Adjusted Score","Matches Other Gene in Same Taxon?","Orig. Target Gene ID","Orig. Target Gene Symbol","Forward Oligo Sequence","Reverse Oligo Sequence",Addgene
human,100190986,LOC100190986,NR_024456.1,TRCN0000164801,NM_016534.2-1646s1c1,CCTCCCAAAGTACTGGGATTA,pLKO.1,252,3UTR,100,100,1.08,.54,Y,51275,MAPKAPK5-AS1,CCGGCCTCCCAAAGTACTGGGATTACTCGAGTAATCCCAGTACTTTGGGAGGTTTTTG,AATTCAAAAACCTCCCAAAGTACTGGGATTACTCGAGTAATCCCAGTACTTTGGGAGG,n/a
human,100190986,LOC100190986,NR_024456.1,TRCN0000084008,NM_004646.1-4013s1c1,CGCCTATAATCCCAGCACTTT,pLKO.1,2182,3UTR,95,95,,,Y,4868,NPHS1,CCGGCGCCTATAATCCCAGCACTTTCTCGAGAAAGTGCTGGGATTATAGGCGTTTTTG,AATTCAAAAACGCCTATAATCCCAGCACTTTCTCGAGAAAGTGCTGGGATTATAGGCG,n/a
human,100190986,LOC100190986,NR_024456.1,TRCN0000172660,NM_024035.1-1257s1c1,GTCTCAAACTTCTGGGCTCAA,pLKO.1,213,3UTR,95,95,,,Y,78998,RHPN1-AS1,CCGGGTCTCAAACTTCTGGGCTCAACTCGAGTTGAGCCCAGAAGTTTGAGACTTTTTG,AATTCAAAAAGTCTCAAACTTCTGGGCTCAACTCGAGTTGAGCCCAGAAGTTTGAGAC,n/a
human,100190986,LOC100190986,NR_024456.1,TRCN0000164834,NM_207497.1-377s1c1,CAAACTCCTGAGCTCAAGCAA,pLKO.1,217,3UTR,95,95,,,Y,401253,LINC00336,CCGGCAAACTCCTGAGCTCAAGCAACTCGAGTTGCTTGAGCTCAGGAGTTTGTTTTTG,AATTCAAAAACAAACTCCTGAGCTCAAGCAACTCGAGTTGCTTGAGCTCAGGAGTTTG,n/a
human,100190986,LOC100190986,NR_024456.1,TRCN0000163829,NM_173639.1-1102s1c1,CCTCCCAAATTACTGGGATTA,pLKO.1,252,3UTR,95,95,,,Y,284618,RUSC1-AS1,CCGGCCTCCCAAATTACTGGGATTACTCGAGTAATCCCAGTAATTTGGGAGGTTTTTG,AATTCAAAAACCTCCCAAATTACTGGGATTACTCGAGTAATCCCAGTAATTTGGGAGG,n/a
human,100190986,LOC100190986,NR_024456.1,TRCN0000140374,NM_025042.2-1098s1c1,GCTTCCCAAAGTACTGGGATT,pLKO.1,251,3UTR,95,95,,,Y,,,CCGGGCTTCCCAAAGTACTGGGATTCTCGAGAATCCCAGTACTTTGGGAAGCTTTTTG,AATTCAAAAAGCTTCCCAAAGTACTGGGATTCTCGAGAATCCCAGTACTTTGGGAAGC,n/a
human,100190986,LOC100190986,NR_024456.1,TRCN0000091448,NM_013513.1-2495s1c1,CCTCCCAAGTACTGGGATTAA,pLKO.1,252,3UTR,90,95,,,Y,13828,Epb42,CCGGCCTCCCAAGTACTGGGATTAACTCGAGTTAATCCCAGTACTTGGGAGGTTTTTG,AATTCAAAAACCTCCCAAGTACTGGGATTAACTCGAGTTAATCCCAGTACTTGGGAGG,n/a
human,100190986,LOC100190986,NR_024456.1,TRCN0000141125,NM_153233.1-1432s1c1,CAGGTTCAAGAGATTCTCCTA,pLKO.1,1737,3UTR,90,95,,,Y,163183,SYNE4,CCGGCAGGTTCAAGAGATTCTCCTACTCGAGTAGGAGAATCTCTTGAACCTGTTTTTG,AATTCAAAAACAGGTTCAAGAGATTCTCCTACTCGAGTAGGAGAATCTCTTGAACCTG,n/a
human,100190986,LOC100190986,NR_024456.1,TRCN0000136945,NM_001012992.1-505s1c1,CCATGATTCAATTACCTCCCA,pLKO.1,728,3UTR,90,95,,,Y,27185,DISC1,CCGGCCATGATTCAATTACCTCCCACTCGAGTGGGAGGTAATTGAATCATGGTTTTTG,AATTCAAAAACCATGATTCAATTACCTCCCACTCGAGTGGGAGGTAATTGAATCATGG,n/a
human,100190986,LOC100190986,NR_024456.1,TRCN0000161800,NM_183239.1-1143s1c1,CCATGATTGATTACCTCCTCT,pLKO.1,728,3UTR,86,95,,,Y,119391,GSTO2,CCGGCCATGATTGATTACCTCCTCTCTCGAGAGAGGAGGTAATCAATCATGGTTTTTG,AATTCAAAAACCATGATTGATTACCTCCTCTCTCGAGAGAGGAGGTAATCAATCATGG,n/a
human,100190986,LOC100190986,NR_024456.1,TRCN0000357019,NM_012152.2-1336s21c1,GATTACCTGTCTCTAACAAAG,pLKO_005,1062,3UTR,85,95,,,Y,23566,LPAR3,CCGGGATTACCTGTCTCTAACAAAGCTCGAGCTTTGTTAGAGACAGGTAATCTTTTTG,AATTCAAAAAGATTACCTGTCTCTAACAAAGCTCGAGCTTTGTTAGAGACAGGTAATC,n/a
human,100190986,LOC100190986,NR_024456.1,TRCN0000240360,NM_001039615.3-795s21c1,TGCACTCACAGTTCCACAATA,pLKO_005,541,3UTR,85,95,,,Y,728957,ZNF705D,CCGGTGCACTCACAGTTCCACAATACTCGAGTATTGTGGAACTGTGAGTGCATTTTTG,AATTCAAAAATGCACTCACAGTTCCACAATACTCGAGTATTGTGGAACTGTGAGTGCA,n/a
human,100190986,LOC100190986,NR_024456.1,TRCN0000048490,NM_002061.1-641s1c1,CCTCCTATTGAAGATGGAGTT,pLKO.1,16,3UTR,90,89,,,Y,2730,GCLM,CCGGCCTCCTATTGAAGATGGAGTTCTCGAGAACTCCATCTTCAATAGGAGGTTTTTG,AATTCAAAAACCTCCTATTGAAGATGGAGTTCTCGAGAACTCCATCTTCAATAGGAGG,n/a
human,100190986,LOC100190986,NR_024456.1,TRCN0000290799,NM_002061.2-681s21c1,CCTCCTATTGAAGATGGAGTT,pLKO_005,16,3UTR,90,89,,,Y,2730,GCLM,CCGGCCTCCTATTGAAGATGGAGTTCTCGAGAACTCCATCTTCAATAGGAGGTTTTTG,AATTCAAAAACCTCCTATTGAAGATGGAGTTCTCGAGAACTCCATCTTCAATAGGAGG,n/a
human,100190986,LOC100190986,NR_024456.1,TRCN0000172468,NM_178520.2-2286s1c1,CCTCTCAAAGCACTGGGATTA,pLKO.1,252,3UTR,90,89,,,Y,284186,TMEM105,CCGGCCTCTCAAAGCACTGGGATTACTCGAGTAATCCCAGTGCTTTGAGAGGTTTTTG,AATTCAAAAACCTCTCAAAGCACTGGGATTACTCGAGTAATCCCAGTGCTTTGAGAGG,n/a
human,100190986,LOC100190986,NR_024456.1,TRCN0000120830,NM_008129.2-784s1c1,CTCCGATTGAAGATGGAGTTA,pLKO.1,17,3UTR,85,89,,,Y,14630,Gclm,CCGGCTCCGATTGAAGATGGAGTTACTCGAGTAACTCCATCTTCAATCGGAGTTTTTG,AATTCAAAAACTCCGATTGAAGATGGAGTTACTCGAGTAACTCCATCTTCAATCGGAG,n/a
human,100190986,LOC100190986,NR_024456.1,TRCN0000345242,NM_008129.3-783s21c1,CTCCGATTGAAGATGGAGTTA,pLKO_005,17,3UTR,85,89,,,Y,14630,Gclm,CCGGCTCCGATTGAAGATGGAGTTACTCGAGTAACTCCATCTTCAATCGGAGTTTTTG,AATTCAAAAACTCCGATTGAAGATGGAGTTACTCGAGTAACTCCATCTTCAATCGGAG,n/a
human,100190986,LOC100190986,NR_024456.1,TRCN0000185098,NM_206823.1-586s1c1,CTGGCACTATTCACTATTTAT,pLKO.1,1322,3UTR,85,89,,,Y,110511,Olfr153,CCGGCTGGCACTATTCACTATTTATCTCGAGATAAATAGTGAATAGTGCCAGTTTTTG,AATTCAAAAACTGGCACTATTCACTATTTATCTCGAGATAAATAGTGAATAGTGCCAG,n/a
human,100190986,LOC100190986,NR_024456.1,TRCN0000241999,NM_177328.3-2260s21c1,TTGGGTATGTGTATTAGTTAT,pLKO_005,459,3UTR,85,89,,,Y,108073,Grm7,CCGGTTGGGTATGTGTATTAGTTATCTCGAGATAACTAATACACATACCCAATTTTTG,AATTCAAAAATTGGGTATGTGTATTAGTTATCTCGAGATAACTAATACACATACCCAA,n/a
human,100190986,LOC100190986,NR_024456.1,TRCN0000139754,NM_017878.1-218s1c1,CCTGACCAACAAAGCCATAGT,pLKO.1,1457,3UTR,80,89,,,Y,54979,PLAAT2,CCGGCCTGACCAACAAAGCCATAGTCTCGAGACTATGGCTTTGTTGGTCAGGTTTTTG,AATTCAAAAACCTGACCAACAAAGCCATAGTCTCGAGACTATGGCTTTGTTGGTCAGG,n/a
human,100190986,LOC100190986,NR_024456.1,TRCN0000277278,NM_146091.3-272s21c1,ACTTTATGCTGCGATACTTAT,pLKO_005,1606,3UTR,80,89,,,Y,109168,Atl3,CCGGACTTTATGCTGCGATACTTATCTCGAGATAAGTATCGCAGCATAAAGTTTTTTG,AATTCAAAAAACTTTATGCTGCGATACTTATCTCGAGATAAGTATCGCAGCATAAAGT,n/a
human,100190986,LOC100190986,NR_024456.1,TRCN0000107542,NM_001004328.1-631s1c1,GCACTCACAGTTCCACAATAA,pLKO.1,542,3UTR,80,89,,,Y,440077,ZNF705A,CCGGGCACTCACAGTTCCACAATAACTCGAGTTATTGTGGAACTGTGAGTGCTTTTTG,AATTCAAAAAGCACTCACAGTTCCACAATAACTCGAGTTATTGTGGAACTGTGAGTGC,n/a
human,100190986,LOC100190986,NR_024456.1,TRCN0000000634,NM_002019.x-2722s1c1,GAGAGACTTAAACTGGGCAAA,pLKO.1,2152,3UTR,81,85,,,Y,2321,FLT1,CCGGGAGAGACTTAAACTGGGCAAACTCGAGTTTGCCCAGTTTAAGTCTCTCTTTTTG,AATTCAAAAAGAGAGACTTAAACTGGGCAAACTCGAGTTTGCCCAGTTTAAGTCTCTC,n/a
human,100190986,LOC100190986,NR_024456.1,TRCN0000313459,NM_008433.3-1037s21c1,AGTTCAACAAGGCGGAGAAAC,pLKO_005,550,3UTR,81,85,,,Y,16534,Kcnn4,CCGGAGTTCAACAAGGCGGAGAAACCTCGAGGTTTCTCCGCCTTGTTGAACTTTTTTG,AATTCAAAAAAGTTCAACAAGGCGGAGAAACCTCGAGGTTTCTCCGCCTTGTTGAACT,n/a
human,100190986,LOC100190986,NR_024456.1,TRCN0000447082,NM_139242.3-659s21c1,GGGTGCCAACATGCTCATTTC,pLKO_005,2079,3UTR,77,85,,,Y,123263,MTFMT,CCGGGGGTGCCAACATGCTCATTTCCTCGAGGAAATGAGCATGTTGGCACCCTTTTTG,AATTCAAAAAGGGTGCCAACATGCTCATTTCCTCGAGGAAATGAGCATGTTGGCACCC,n/a
human,100190986,LOC100190986,NR_024456.1,TRCN0000068399,NM_008433.2-1037s1c1,GAGTTCAACAAGGCGGAGAAA,pLKO.1,549,3UTR,77,85,,,Y,16534,Kcnn4,CCGGGAGTTCAACAAGGCGGAGAAACTCGAGTTTCTCCGCCTTGTTGAACTCTTTTTG,AATTCAAAAAGAGTTCAACAAGGCGGAGAAACTCGAGTTTCTCCGCCTTGTTGAACTC,n/a
