Taxon,"Gene ID","Gene Symbol",Transcript,"Clone ID","Legacy Clone Name","Target Seq",Vector,"Match Position","Match Region","Match %","SDR Match %","Intrinsic Score","Adjusted Score","Matches Other Gene in Same Taxon?","Orig. Target Gene ID","Orig. Target Gene Symbol","Forward Oligo Sequence","Reverse Oligo Sequence",Addgene
human,285972,LINC00996,NR_034033.1,TRCN0000122041,XM_380154.1-1541s1c1,GCTGTAGTAAACACACACATT,pLKO.1,1541,3UTR,100,100,4.95,3.465,N,285972,LINC00996,CCGGGCTGTAGTAAACACACACATTCTCGAGAATGTGTGTGTTTACTACAGCTTTTTG,AATTCAAAAAGCTGTAGTAAACACACACATTCTCGAGAATGTGTGTGTTTACTACAGC,n/a
human,285972,LINC00996,NR_034033.1,TRCN0000430981,NM_173537.2-3266s21c1,GCCACCATGCCTGGCTAATTT,pLKO_005,1265,3UTR,100,100,15,7.5,Y,84163,GTF2IRD2,CCGGGCCACCATGCCTGGCTAATTTCTCGAGAAATTAGCCAGGCATGGTGGCTTTTTG,AATTCAAAAAGCCACCATGCCTGGCTAATTTCTCGAGAAATTAGCCAGGCATGGTGGC,n/a
human,285972,LINC00996,NR_034033.1,TRCN0000134716,NM_022901.1-2328s1c1,GCCTGGCTAATTTCTGTATTT,pLKO.1,1273,3UTR,95,95,,,Y,64922,LRRC19,CCGGGCCTGGCTAATTTCTGTATTTCTCGAGAAATACAGAAATTAGCCAGGCTTTTTG,AATTCAAAAAGCCTGGCTAATTTCTGTATTTCTCGAGAAATACAGAAATTAGCCAGGC,n/a
human,285972,LINC00996,NR_034033.1,TRCN0000148755,NM_032285.1-1973s1c1,CGAACTCCTGACTCAAATGAT,pLKO.1,1335,3UTR,90,90,,,Y,84245,MRI1,CCGGCGAACTCCTGACTCAAATGATCTCGAGATCATTTGAGTCAGGAGTTCGTTTTTG,AATTCAAAAACGAACTCCTGACTCAAATGATCTCGAGATCATTTGAGTCAGGAGTTCG,n/a
human,285972,LINC00996,NR_034033.1,TRCN0000413044,NM_183168.2-1548s21c1,TGATTTGGCAACTGGTCAATT,pLKO_005,1640,3UTR,86,90,,,N,233571,P2ry6,CCGGTGATTTGGCAACTGGTCAATTCTCGAGAATTGACCAGTTGCCAAATCATTTTTG,AATTCAAAAATGATTTGGCAACTGGTCAATTCTCGAGAATTGACCAGTTGCCAAATCA,n/a
human,285972,LINC00996,NR_034033.1,TRCN0000188945,XM_290579.3-2008s1c1,GCCAGGATGCTCTTGAACAAA,pLKO.1,1322,3UTR,80,89,,,Y,338797,LINC02370,CCGGGCCAGGATGCTCTTGAACAAACTCGAGTTTGTTCAAGAGCATCCTGGCTTTTTG,AATTCAAAAAGCCAGGATGCTCTTGAACAAACTCGAGTTTGTTCAAGAGCATCCTGGC,n/a
human,285972,LINC00996,NR_034033.1,TRCN0000158599,NM_194294.1-363s1c1,CTTCTTCCAGATTCTCTGAAA,pLKO.1,26,3UTR,80,89,,,Y,169355,IDO2,CCGGCTTCTTCCAGATTCTCTGAAACTCGAGTTTCAGAGAATCTGGAAGAAGTTTTTG,AATTCAAAAACTTCTTCCAGATTCTCTGAAACTCGAGTTTCAGAGAATCTGGAAGAAG,n/a
human,285972,LINC00996,NR_034033.1,TRCN0000098061,NM_009337.2-276s1c1,GCCTTTAATGTGGCAACTGTA,pLKO.1,1635,3UTR,80,89,,,Y,21432,Tcl1,CCGGGCCTTTAATGTGGCAACTGTACTCGAGTACAGTTGCCACATTAAAGGCTTTTTG,AATTCAAAAAGCCTTTAATGTGGCAACTGTACTCGAGTACAGTTGCCACATTAAAGGC,n/a
