Taxon,"Gene ID","Gene Symbol",Transcript,"Clone ID","Legacy Clone Name","Target Seq",Vector,"Match Position","Match Region","Match %","SDR Match %","Intrinsic Score","Adjusted Score","Matches Other Gene in Same Taxon?","Orig. Target Gene ID","Orig. Target Gene Symbol","Forward Oligo Sequence","Reverse Oligo Sequence",Addgene
human,100131564,CCDC18-AS1,NR_034089.1,TRCN0000078113,NM_006859.2-1344s1c1,GCCTGTAATCCCAGCACTTTA,pLKO.1,2408,3UTR,95,100,13.2,6.6,Y,11019,LIAS,CCGGGCCTGTAATCCCAGCACTTTACTCGAGTAAAGTGCTGGGATTACAGGCTTTTTG,AATTCAAAAAGCCTGTAATCCCAGCACTTTACTCGAGTAAAGTGCTGGGATTACAGGC,n/a
human,100131564,CCDC18-AS1,NR_034089.1,TRCN0000155836,NM_198582.1-3275s1c1,CCCAAAGTGCTGGGATTACAA,pLKO.1,3363,3UTR,95,100,5.625,2.8125,Y,377007,KLHL30,CCGGCCCAAAGTGCTGGGATTACAACTCGAGTTGTAATCCCAGCACTTTGGGTTTTTG,AATTCAAAAACCCAAAGTGCTGGGATTACAACTCGAGTTGTAATCCCAGCACTTTGGG,n/a
human,100131564,CCDC18-AS1,NR_034089.1,TRCN0000141025,NM_152361.1-835s1c1,CCCAAAGTGCTGGGATTACTT,pLKO.1,3363,3UTR,90,100,5.625,2.8125,Y,126272,EID2B,CCGGCCCAAAGTGCTGGGATTACTTCTCGAGAAGTAATCCCAGCACTTTGGGTTTTTG,AATTCAAAAACCCAAAGTGCTGGGATTACTTCTCGAGAAGTAATCCCAGCACTTTGGG,n/a
human,100131564,CCDC18-AS1,NR_034089.1,TRCN0000199172,NM_002759.1-2425s1c1,CCTCCTGAGTAGCTGGATTAC,pLKO.1,3225,3UTR,85,95,,,Y,5610,EIF2AK2,CCGGCCTCCTGAGTAGCTGGATTACCTCGAGGTAATCCAGCTACTCAGGAGGTTTTTG,AATTCAAAAACCTCCTGAGTAGCTGGATTACCTCGAGGTAATCCAGCTACTCAGGAGG,n/a
human,100131564,CCDC18-AS1,NR_034089.1,TRCN0000051424,NM_022819.1-267s1c1,CATCGAGAACAACACTGAGAT,pLKO.1,2039,3UTR,86,90,,,Y,64600,PLA2G2F,CCGGCATCGAGAACAACACTGAGATCTCGAGATCTCAGTGTTGTTCTCGATGTTTTTG,AATTCAAAAACATCGAGAACAACACTGAGATCTCGAGATCTCAGTGTTGTTCTCGATG,n/a
human,100131564,CCDC18-AS1,NR_034089.1,TRCN0000107136,NM_004918.2-340s1c1,GATTCCAGTTTCTGGGAAATA,pLKO.1,951,3UTR,81,90,,,Y,9623,TCL1B,CCGGGATTCCAGTTTCTGGGAAATACTCGAGTATTTCCCAGAAACTGGAATCTTTTTG,AATTCAAAAAGATTCCAGTTTCTGGGAAATACTCGAGTATTTCCCAGAAACTGGAATC,n/a
human,100131564,CCDC18-AS1,NR_034089.1,TRCN0000140610,NM_025042.2-931s1c1,GCCTCTCAGGTTCAAGCAATT,pLKO.1,3192,3UTR,90,89,,,Y,,,CCGGGCCTCTCAGGTTCAAGCAATTCTCGAGAATTGCTTGAACCTGAGAGGCTTTTTG,AATTCAAAAAGCCTCTCAGGTTCAAGCAATTCTCGAGAATTGCTTGAACCTGAGAGGC,n/a
human,100131564,CCDC18-AS1,NR_034089.1,TRCN0000245670,NM_001080443.1-775s21c1,ATGCCATCTTCCAGATCTTTG,pLKO_005,3714,3UTR,85,89,,,Y,146909,KIF18B,CCGGATGCCATCTTCCAGATCTTTGCTCGAGCAAAGATCTGGAAGATGGCATTTTTTG,AATTCAAAAAATGCCATCTTCCAGATCTTTGCTCGAGCAAAGATCTGGAAGATGGCAT,n/a
human,100131564,CCDC18-AS1,NR_034089.1,TRCN0000073220,NM_203412.1-258s1c1,CACCTCTCTGACTACTGCATT,pLKO.1,2277,3UTR,85,89,,,Y,164153,UBL4B,CCGGCACCTCTCTGACTACTGCATTCTCGAGAATGCAGTAGTCAGAGAGGTGTTTTTG,AATTCAAAAACACCTCTCTGACTACTGCATTCTCGAGAATGCAGTAGTCAGAGAGGTG,n/a
human,100131564,CCDC18-AS1,NR_034089.1,TRCN0000001371,NM_002730.x-432s1c1,AGGTGGTGAAACTGAAACAGA,pLKO.1,2113,3UTR,85,89,,,Y,5566,PRKACA,CCGGAGGTGGTGAAACTGAAACAGACTCGAGTCTGTTTCAGTTTCACCACCTTTTTTG,AATTCAAAAAAGGTGGTGAAACTGAAACAGACTCGAGTCTGTTTCAGTTTCACCACCT,n/a
human,100131564,CCDC18-AS1,NR_034089.1,TRCN0000295216,NM_013733.3-2642s21c1,CCATGTGCATCACGCAGTTTA,pLKO_005,3788,3UTR,85,89,,,Y,27221,Chaf1a,CCGGCCATGTGCATCACGCAGTTTACTCGAGTAAACTGCGTGATGCACATGGTTTTTG,AATTCAAAAACCATGTGCATCACGCAGTTTACTCGAGTAAACTGCGTGATGCACATGG,n/a
human,100131564,CCDC18-AS1,NR_034089.1,TRCN0000091420,NM_007599.1-1245s1c1,TCCCATCTTCAAGCAATTCTT,pLKO.1,3195,3UTR,85,89,,,Y,12332,Capg,CCGGTCCCATCTTCAAGCAATTCTTCTCGAGAAGAATTGCTTGAAGATGGGATTTTTG,AATTCAAAAATCCCATCTTCAAGCAATTCTTCTCGAGAAGAATTGCTTGAAGATGGGA,n/a
human,100131564,CCDC18-AS1,NR_034089.1,TRCN0000318310,NM_007599.3-1055s21c1,TCCCATCTTCAAGCAATTCTT,pLKO_005,3195,3UTR,85,89,,,Y,12332,Capg,CCGGTCCCATCTTCAAGCAATTCTTCTCGAGAAGAATTGCTTGAAGATGGGATTTTTG,AATTCAAAAATCCCATCTTCAAGCAATTCTTCTCGAGAAGAATTGCTTGAAGATGGGA,n/a
human,100131564,CCDC18-AS1,NR_034089.1,TRCN0000165833,NM_178514.3-1640s1c1,GCTCACTACAACCTCCACTTT,pLKO.1,3176,3UTR,85,89,,,Y,283487,LINC00346,CCGGGCTCACTACAACCTCCACTTTCTCGAGAAAGTGGAGGTTGTAGTGAGCTTTTTG,AATTCAAAAAGCTCACTACAACCTCCACTTTCTCGAGAAAGTGGAGGTTGTAGTGAGC,n/a
human,100131564,CCDC18-AS1,NR_034089.1,TRCN0000165026,NM_001012391.1-1008s1c1,GTAGAGAAAGGGTTTCGCCAT,pLKO.1,3287,3UTR,85,89,,,Y,100652781,SNX29P1,CCGGGTAGAGAAAGGGTTTCGCCATCTCGAGATGGCGAAACCCTTTCTCTACTTTTTG,AATTCAAAAAGTAGAGAAAGGGTTTCGCCATCTCGAGATGGCGAAACCCTTTCTCTAC,n/a
human,100131564,CCDC18-AS1,NR_034089.1,TRCN0000040158,NM_017489.1-1753s1c1,GCGCAATTTCAGCTCACTGAA,pLKO.1,3165,3UTR,85,89,,,Y,7013,TERF1,CCGGGCGCAATTTCAGCTCACTGAACTCGAGTTCAGTGAGCTGAAATTGCGCTTTTTG,AATTCAAAAAGCGCAATTTCAGCTCACTGAACTCGAGTTCAGTGAGCTGAAATTGCGC,n/a
human,100131564,CCDC18-AS1,NR_034089.1,TRCN0000196672,NM_018343.1-153s1c1,GCAGTTTGATTGCTTCTATAG,pLKO.1,3600,3UTR,80,89,,,Y,55781,RIOK2,CCGGGCAGTTTGATTGCTTCTATAGCTCGAGCTATAGAAGCAATCAAACTGCTTTTTG,AATTCAAAAAGCAGTTTGATTGCTTCTATAGCTCGAGCTATAGAAGCAATCAAACTGC,n/a
human,100131564,CCDC18-AS1,NR_034089.1,TRCN0000381434,NM_014353.4-1393s21c1,GCTCTGGCTCAAACAGCAATA,pLKO_005,766,3UTR,80,89,,,Y,25837,RAB26,CCGGGCTCTGGCTCAAACAGCAATACTCGAGTATTGCTGTTTGAGCCAGAGCTTTTTG,AATTCAAAAAGCTCTGGCTCAAACAGCAATACTCGAGTATTGCTGTTTGAGCCAGAGC,n/a
human,100131564,CCDC18-AS1,NR_034089.1,TRCN0000378777,NM_007102.2-289s21c1,AGCATCTTCAAGACCCTGAGG,pLKO_005,1577,3UTR,80,89,,,Y,2981,GUCA2B,CCGGAGCATCTTCAAGACCCTGAGGCTCGAGCCTCAGGGTCTTGAAGATGCTTTTTTG,AATTCAAAAAAGCATCTTCAAGACCCTGAGGCTCGAGCCTCAGGGTCTTGAAGATGCT,n/a
human,100131564,CCDC18-AS1,NR_034089.1,TRCN0000194369,NM_010102.1-575s1c1,CTCATTGTCCTGCACTACAAT,pLKO.1,1368,3UTR,80,89,,,Y,13611,S1pr4,CCGGCTCATTGTCCTGCACTACAATCTCGAGATTGTAGTGCAGGACAATGAGTTTTTG,AATTCAAAAACTCATTGTCCTGCACTACAATCTCGAGATTGTAGTGCAGGACAATGAG,n/a
human,100131564,CCDC18-AS1,NR_034089.1,TRCN0000366938,NM_011624.2-2152s21c1,TGGGAAGTGCCATCGATTTAT,pLKO_005,470,3UTR,80,89,,,Y,21976,Top3b,CCGGTGGGAAGTGCCATCGATTTATCTCGAGATAAATCGATGGCACTTCCCATTTTTG,AATTCAAAAATGGGAAGTGCCATCGATTTATCTCGAGATAAATCGATGGCACTTCCCA,n/a
human,100131564,CCDC18-AS1,NR_034089.1,TRCN0000203132,NM_001011756.1-495s1c1,GATTCAGTTCTGCAAGTTAAA,pLKO.1,1026,3UTR,80,89,,,Y,257912,Olfr948,CCGGGATTCAGTTCTGCAAGTTAAACTCGAGTTTAACTTGCAGAACTGAATCTTTTTG,AATTCAAAAAGATTCAGTTCTGCAAGTTAAACTCGAGTTTAACTTGCAGAACTGAATC,n/a
human,100131564,CCDC18-AS1,NR_034089.1,TRCN0000177221,NM_178612.2-725s1c1,GAGGAAGAAGAAGAAGAGATA,pLKO.1,588,3UTR,80,89,,,Y,66455,Cnpy4,CCGGGAGGAAGAAGAAGAAGAGATACTCGAGTATCTCTTCTTCTTCTTCCTCTTTTTG,AATTCAAAAAGAGGAAGAAGAAGAAGAGATACTCGAGTATCTCTTCTTCTTCTTCCTC,n/a
human,100131564,CCDC18-AS1,NR_034089.1,TRCN0000256660,NM_026788.1-427s21c1,TCTGCAGTGAGCTCATCATAA,pLKO_005,1705,3UTR,78,86,,,Y,665563,Mthfd2l,CCGGTCTGCAGTGAGCTCATCATAACTCGAGTTATGATGAGCTCACTGCAGATTTTTG,AATTCAAAAATCTGCAGTGAGCTCATCATAACTCGAGTTATGATGAGCTCACTGCAGA,n/a
human,100131564,CCDC18-AS1,NR_034089.1,TRCN0000162829,NM_207497.1-336s1c1,CTTAGTGAGACAAGGTTTCAC,pLKO.1,3283,3UTR,86,85,,,Y,401253,LINC00336,CCGGCTTAGTGAGACAAGGTTTCACCTCGAGGTGAAACCTTGTCTCACTAAGTTTTTG,AATTCAAAAACTTAGTGAGACAAGGTTTCACCTCGAGGTGAAACCTTGTCTCACTAAG,n/a
human,100131564,CCDC18-AS1,NR_034089.1,TRCN0000375392,NM_025907.3-1434s21c1,AGGTTTGGCAATTTGAGTTTA,pLKO_005,2803,3UTR,81,85,,,Y,67011,Mettl6,CCGGAGGTTTGGCAATTTGAGTTTACTCGAGTAAACTCAAATTGCCAAACCTTTTTTG,AATTCAAAAAAGGTTTGGCAATTTGAGTTTACTCGAGTAAACTCAAATTGCCAAACCT,n/a
human,100131564,CCDC18-AS1,NR_034089.1,TRCN0000277618,NM_018994.1-2501s21c1,CACTCCAGGCTGGGATCAAAT,pLKO_005,1733,3UTR,81,85,,,Y,54455,FBXO42,CCGGCACTCCAGGCTGGGATCAAATCTCGAGATTTGATCCCAGCCTGGAGTGTTTTTG,AATTCAAAAACACTCCAGGCTGGGATCAAATCTCGAGATTTGATCCCAGCCTGGAGTG,n/a
human,100131564,CCDC18-AS1,NR_034089.1,TRCN0000002733,NM_176826.x-351s1c1,TGTGAGAAACTGGGCATCCGT,pLKO.1,3694,3UTR,81,85,,,Y,10994,ILVBL,CCGGTGTGAGAAACTGGGCATCCGTCTCGAGACGGATGCCCAGTTTCTCACATTTTTG,AATTCAAAAATGTGAGAAACTGGGCATCCGTCTCGAGACGGATGCCCAGTTTCTCACA,n/a
human,100131564,CCDC18-AS1,NR_034089.1,TRCN0000027506,NM_008703.1-672s1c1,CCTTGTTATCATCAGCATTTA,pLKO.1,1986,3UTR,81,85,,,Y,18101,Nmbr,CCGGCCTTGTTATCATCAGCATTTACTCGAGTAAATGCTGATGATAACAAGGTTTTTG,AATTCAAAAACCTTGTTATCATCAGCATTTACTCGAGTAAATGCTGATGATAACAAGG,n/a
human,100131564,CCDC18-AS1,NR_034089.1,TRCN0000150626,NM_006911.2-582s1c1,GCTTGGATACTCATTCTCAAA,pLKO.1,1833,3UTR,77,85,,,Y,6013,RLN1,CCGGGCTTGGATACTCATTCTCAAACTCGAGTTTGAGAATGAGTATCCAAGCTTTTTG,AATTCAAAAAGCTTGGATACTCATTCTCAAACTCGAGTTTGAGAATGAGTATCCAAGC,n/a
