Taxon,"Gene ID","Gene Symbol",Transcript,"Clone ID","Legacy Clone Name","Target Seq",Vector,"Match Position","Match Region","Match %","SDR Match %","Intrinsic Score","Adjusted Score","Matches Other Gene in Same Taxon?","Orig. Target Gene ID","Orig. Target Gene Symbol","Forward Oligo Sequence","Reverse Oligo Sequence",Addgene
human,100132288,TEKT4P2,NR_038329.2,TRCN0000159185,NM_001033515.1-103s1c1,GAGCAACAAGAAACGAATAAA,pLKO.1,112,3UTR,100,100,15,7.5,Y,100132288,TEKT4P2,CCGGGAGCAACAAGAAACGAATAAACTCGAGTTTATTCGTTTCTTGTTGCTCTTTTTG,AATTCAAAAAGAGCAACAAGAAACGAATAAACTCGAGTTTATTCGTTTCTTGTTGCTC,n/a
human,100132288,TEKT4P2,NR_038329.2,TRCN0000159736,NM_001033515.1-105s1c1,GCAACAAGAAACGAATAAATC,pLKO.1,114,3UTR,100,100,13.2,6.6,Y,100132288,TEKT4P2,CCGGGCAACAAGAAACGAATAAATCCTCGAGGATTTATTCGTTTCTTGTTGCTTTTTG,AATTCAAAAAGCAACAAGAAACGAATAAATCCTCGAGGATTTATTCGTTTCTTGTTGC,n/a
human,100132288,TEKT4P2,NR_038329.2,TRCN0000161734,NM_001033515.1-99s1c1,CCAAGAGCAACAAGAAACGAA,pLKO.1,108,3UTR,100,100,3,1.5,Y,100132288,TEKT4P2,CCGGCCAAGAGCAACAAGAAACGAACTCGAGTTCGTTTCTTGTTGCTCTTGGTTTTTG,AATTCAAAAACCAAGAGCAACAAGAAACGAACTCGAGTTCGTTTCTTGTTGCTCTTGG,n/a
human,100132288,TEKT4P2,NR_038329.2,TRCN0000082915,NM_012130.2-782s1c1,CCAGCTGCCTACAAAGACAAT,pLKO.1,231,3UTR,81,90,,,Y,23562,CLDN14,CCGGCCAGCTGCCTACAAAGACAATCTCGAGATTGTCTTTGTAGGCAGCTGGTTTTTG,AATTCAAAAACCAGCTGCCTACAAAGACAATCTCGAGATTGTCTTTGTAGGCAGCTGG,n/a
human,100132288,TEKT4P2,NR_038329.2,TRCN0000148460,NM_020443.2-5621s1c1,CCTGTGGAACAACTCTATCAT,pLKO.1,880,3UTR,85,89,,,Y,89796,NAV1,CCGGCCTGTGGAACAACTCTATCATCTCGAGATGATAGAGTTGTTCCACAGGTTTTTG,AATTCAAAAACCTGTGGAACAACTCTATCATCTCGAGATGATAGAGTTGTTCCACAGG,n/a
human,100132288,TEKT4P2,NR_038329.2,TRCN0000241147,NM_026872.1-376s21c1,ATGTGAACAAAGCTATCAATA,pLKO_005,881,3UTR,80,89,,,Y,68926,Ubap2,CCGGATGTGAACAAAGCTATCAATACTCGAGTATTGATAGCTTTGTTCACATTTTTTG,AATTCAAAAAATGTGAACAAAGCTATCAATACTCGAGTATTGATAGCTTTGTTCACAT,n/a
human,100132288,TEKT4P2,NR_038329.2,TRCN0000350452,NM_018449.2-355s21c1,ATGTGAACAAAGCTATCAATA,pLKO_005,881,3UTR,80,89,,,Y,55833,UBAP2,CCGGATGTGAACAAAGCTATCAATACTCGAGTATTGATAGCTTTGTTCACATTTTTTG,AATTCAAAAAATGTGAACAAAGCTATCAATACTCGAGTATTGATAGCTTTGTTCACAT,n/a
human,100132288,TEKT4P2,NR_038329.2,TRCN0000013748,NM_001913.2-2680s1c1,GCTTTCTTCTTTAGCAAGATA,pLKO.1,1290,3UTR,81,85,,,Y,1523,CUX1,CCGGGCTTTCTTCTTTAGCAAGATACTCGAGTATCTTGCTAAAGAAGAAAGCTTTTTG,AATTCAAAAAGCTTTCTTCTTTAGCAAGATACTCGAGTATCTTGCTAAAGAAGAAAGC,n/a
human,100132288,TEKT4P2,NR_038329.2,TRCN0000415241,NM_017778.2-2617s21c1,CAATTGCTTTAACAGTCAAAT,pLKO_005,582,3UTR,77,85,,,Y,54904,NSD3,CCGGCAATTGCTTTAACAGTCAAATCTCGAGATTTGACTGTTAAAGCAATTGTTTTTG,AATTCAAAAACAATTGCTTTAACAGTCAAATCTCGAGATTTGACTGTTAAAGCAATTG,n/a
