Taxon,"Gene ID","Gene Symbol",Transcript,"Clone ID","Legacy Clone Name","Target Seq",Vector,"Match Position","Match Region","Match %","SDR Match %","Intrinsic Score","Adjusted Score","Matches Other Gene in Same Taxon?","Orig. Target Gene ID","Orig. Target Gene Symbol","Forward Oligo Sequence","Reverse Oligo Sequence",Addgene
human,100128025,WWTR1-AS1,NR_040250.1,TRCN0000155836,NM_198582.1-3275s1c1,CCCAAAGTGCTGGGATTACAA,pLKO.1,714,3UTR,95,100,5.625,2.8125,Y,377007,KLHL30,CCGGCCCAAAGTGCTGGGATTACAACTCGAGTTGTAATCCCAGCACTTTGGGTTTTTG,AATTCAAAAACCCAAAGTGCTGGGATTACAACTCGAGTTGTAATCCCAGCACTTTGGG,n/a
human,100128025,WWTR1-AS1,NR_040250.1,TRCN0000141025,NM_152361.1-835s1c1,CCCAAAGTGCTGGGATTACTT,pLKO.1,714,3UTR,90,100,5.625,2.8125,Y,126272,EID2B,CCGGCCCAAAGTGCTGGGATTACTTCTCGAGAAGTAATCCCAGCACTTTGGGTTTTTG,AATTCAAAAACCCAAAGTGCTGGGATTACTTCTCGAGAAGTAATCCCAGCACTTTGGG,n/a
human,100128025,WWTR1-AS1,NR_040250.1,TRCN0000063698,NM_006989.3-4525s1c1,GCCCAGCTAATTCTTGTATTT,pLKO.1,611,3UTR,95,95,,,Y,10156,RASA4,CCGGGCCCAGCTAATTCTTGTATTTCTCGAGAAATACAAGAATTAGCTGGGCTTTTTG,AATTCAAAAAGCCCAGCTAATTCTTGTATTTCTCGAGAAATACAAGAATTAGCTGGGC,n/a
human,100128025,WWTR1-AS1,NR_040250.1,TRCN0000150276,NM_144718.2-3773s1c1,GCCCAGCTAATTTGTGTATTT,pLKO.1,611,3UTR,95,95,,,Y,152185,SPICE1,CCGGGCCCAGCTAATTTGTGTATTTCTCGAGAAATACACAAATTAGCTGGGCTTTTTG,AATTCAAAAAGCCCAGCTAATTTGTGTATTTCTCGAGAAATACACAAATTAGCTGGGC,n/a
human,100128025,WWTR1-AS1,NR_040250.1,TRCN0000162795,NM_017842.1-1079s1c1,CTTCCAAAGTGCTGGGATTAT,pLKO.1,712,3UTR,90,95,,,Y,55652,SLC48A1,CCGGCTTCCAAAGTGCTGGGATTATCTCGAGATAATCCCAGCACTTTGGAAGTTTTTG,AATTCAAAAACTTCCAAAGTGCTGGGATTATCTCGAGATAATCCCAGCACTTTGGAAG,n/a
human,100128025,WWTR1-AS1,NR_040250.1,TRCN0000163634,NM_201520.1-2351s1c1,GCTCCCTAAGTGCTGGAATTA,pLKO.1,711,3UTR,90,89,,,Y,399512,SLC25A35,CCGGGCTCCCTAAGTGCTGGAATTACTCGAGTAATTCCAGCACTTAGGGAGCTTTTTG,AATTCAAAAAGCTCCCTAAGTGCTGGAATTACTCGAGTAATTCCAGCACTTAGGGAGC,n/a
human,100128025,WWTR1-AS1,NR_040250.1,TRCN0000140610,NM_025042.2-931s1c1,GCCTCTCAGGTTCAAGCAATT,pLKO.1,1127,3UTR,90,89,,,Y,,,CCGGGCCTCTCAGGTTCAAGCAATTCTCGAGAATTGCTTGAACCTGAGAGGCTTTTTG,AATTCAAAAAGCCTCTCAGGTTCAAGCAATTCTCGAGAATTGCTTGAACCTGAGAGGC,n/a
human,100128025,WWTR1-AS1,NR_040250.1,TRCN0000138489,XM_374933.1-361s1c1,CAGAATGAAGTGCAGTGGCAT,pLKO.1,1083,3UTR,90,89,,,Y,399949,C11orf88,CCGGCAGAATGAAGTGCAGTGGCATCTCGAGATGCCACTGCACTTCATTCTGTTTTTG,AATTCAAAAACAGAATGAAGTGCAGTGGCATCTCGAGATGCCACTGCACTTCATTCTG,n/a
human,100128025,WWTR1-AS1,NR_040250.1,TRCN0000089693,NM_172612.1-1838s1c1,GCTTCCTAAGTGCTGGGATTA,pLKO.1,711,3UTR,90,89,,,Y,223881,Rnd1,CCGGGCTTCCTAAGTGCTGGGATTACTCGAGTAATCCCAGCACTTAGGAAGCTTTTTG,AATTCAAAAAGCTTCCTAAGTGCTGGGATTACTCGAGTAATCCCAGCACTTAGGAAGC,n/a
human,100128025,WWTR1-AS1,NR_040250.1,TRCN0000055178,NM_011368.3-519s1c1,GCCGACTGCAAACAGATCATT,pLKO.1,1585,3UTR,85,89,,,Y,20416,Shc1,CCGGGCCGACTGCAAACAGATCATTCTCGAGAATGATCTGTTTGCAGTCGGCTTTTTG,AATTCAAAAAGCCGACTGCAAACAGATCATTCTCGAGAATGATCTGTTTGCAGTCGGC,n/a
human,100128025,WWTR1-AS1,NR_040250.1,TRCN0000301526,NM_011368.4-518s21c1,GCCGACTGCAAACAGATCATT,pLKO_005,1585,3UTR,85,89,,,Y,20416,Shc1,CCGGGCCGACTGCAAACAGATCATTCTCGAGAATGATCTGTTTGCAGTCGGCTTTTTG,AATTCAAAAAGCCGACTGCAAACAGATCATTCTCGAGAATGATCTGTTTGCAGTCGGC,n/a
human,100128025,WWTR1-AS1,NR_040250.1,TRCN0000270550,NM_001033792.1-1099s21c1,GAGACGGAGTCTCACTGTATC,pLKO_005,1059,3UTR,85,89,,,Y,545963,Gm5897,CCGGGAGACGGAGTCTCACTGTATCCTCGAGGATACAGTGAGACTCCGTCTCTTTTTG,AATTCAAAAAGAGACGGAGTCTCACTGTATCCTCGAGGATACAGTGAGACTCCGTCTC,n/a
human,100128025,WWTR1-AS1,NR_040250.1,TRCN0000193581,NM_134127.1-1934s1c1,GTCTTACTCTATTGCCCAATA,pLKO.1,1067,3UTR,85,89,,,Y,106648,Cyp4f15,CCGGGTCTTACTCTATTGCCCAATACTCGAGTATTGGGCAATAGAGTAAGACTTTTTG,AATTCAAAAAGTCTTACTCTATTGCCCAATACTCGAGTATTGGGCAATAGAGTAAGAC,n/a
human,100128025,WWTR1-AS1,NR_040250.1,TRCN0000368669,NM_000823.2-403s21c1,CTGGCTGAGGAGGAATCTTAC,pLKO_005,397,3UTR,80,89,,,Y,2692,GHRHR,CCGGCTGGCTGAGGAGGAATCTTACCTCGAGGTAAGATTCCTCCTCAGCCAGTTTTTG,AATTCAAAAACTGGCTGAGGAGGAATCTTACCTCGAGGTAAGATTCCTCCTCAGCCAG,n/a
human,100128025,WWTR1-AS1,NR_040250.1,TRCN0000255472,NM_001105281.1-202s21c1,GGAGAAGAGTTTGAGGAAATC,pLKO_005,817,3UTR,80,89,,,Y,646486,FABP12,CCGGGGAGAAGAGTTTGAGGAAATCCTCGAGGATTTCCTCAAACTCTTCTCCTTTTTG,AATTCAAAAAGGAGAAGAGTTTGAGGAAATCCTCGAGGATTTCCTCAAACTCTTCTCC,n/a
human,100128025,WWTR1-AS1,NR_040250.1,TRCN0000255441,NM_032737.2-1817s21c1,AGTTTGGCGAGGAGGATCTTT,pLKO_005,394,3UTR,81,85,,,Y,84823,LMNB2,CCGGAGTTTGGCGAGGAGGATCTTTCTCGAGAAAGATCCTCCTCGCCAAACTTTTTTG,AATTCAAAAAAGTTTGGCGAGGAGGATCTTTCTCGAGAAAGATCCTCCTCGCCAAACT,n/a
human,100128025,WWTR1-AS1,NR_040250.1,TRCN0000086389,NM_009261.1-385s1c1,GCTTGCTGATTAAAGATGATA,pLKO.1,1373,3UTR,81,85,,,Y,20744,Strbp,CCGGGCTTGCTGATTAAAGATGATACTCGAGTATCATCTTTAATCAGCAAGCTTTTTG,AATTCAAAAAGCTTGCTGATTAAAGATGATACTCGAGTATCATCTTTAATCAGCAAGC,n/a
human,100128025,WWTR1-AS1,NR_040250.1,TRCN0000315912,NM_009261.3-448s21c1,GCTTGCTGATTAAAGATGATA,pLKO_005,1373,3UTR,81,85,,,Y,20744,Strbp,CCGGGCTTGCTGATTAAAGATGATACTCGAGTATCATCTTTAATCAGCAAGCTTTTTG,AATTCAAAAAGCTTGCTGATTAAAGATGATACTCGAGTATCATCTTTAATCAGCAAGC,n/a
human,100128025,WWTR1-AS1,NR_040250.1,TRCN0000044650,NM_003047.2-1870s1c1,CCTGACCTGGTTCATCAACAA,pLKO.1,127,3UTR,77,85,,,Y,6548,SLC9A1,CCGGCCTGACCTGGTTCATCAACAACTCGAGTTGTTGATGAACCAGGTCAGGTTTTTG,AATTCAAAAACCTGACCTGGTTCATCAACAACTCGAGTTGTTGATGAACCAGGTCAGG,n/a
human,100128025,WWTR1-AS1,NR_040250.1,TRCN0000201860,NM_053088.1-177s1c1,GAATCTGTGCTGCCTTGGATT,pLKO.1,797,3UTR,77,85,,,Y,73835,Ifitm5,CCGGGAATCTGTGCTGCCTTGGATTCTCGAGAATCCAAGGCAGCACAGATTCTTTTTG,AATTCAAAAAGAATCTGTGCTGCCTTGGATTCTCGAGAATCCAAGGCAGCACAGATTC,n/a
