Taxon,"Gene ID","Gene Symbol",Transcript,"Clone ID","Legacy Clone Name","Target Seq",Vector,"Match Position","Match Region","Match %","SDR Match %","Intrinsic Score","Adjusted Score","Matches Other Gene in Same Taxon?","Orig. Target Gene ID","Orig. Target Gene Symbol","Forward Oligo Sequence","Reverse Oligo Sequence",Addgene
mouse,353109,Scgb2b23-ps,NR_045685.1,TRCN0000190111,NM_001009952.1-159s1c1,CTCCAGGCATTCAATGCTACT,pLKO.1,147,3UTR,100,100,4.05,2.025,Y,494519,Scgb2b20,CCGGCTCCAGGCATTCAATGCTACTCTCGAGAGTAGCATTGAATGCCTGGAGTTTTTG,AATTCAAAAACTCCAGGCATTCAATGCTACTCTCGAGAGTAGCATTGAATGCCTGGAG,n/a
mouse,353109,Scgb2b23-ps,NR_045685.1,TRCN0000221543,NM_004958.2-640s1c2,GCAACCCTTCTTTGACAACAT,pLKO.1,370,3UTR,90,89,,,Y,2475,MTOR,CCGGGCAACCCTTCTTTGACAACATCTCGAGATGTTGTCAAAGAAGGGTTGCTTTTTG,AATTCAAAAAGCAACCCTTCTTTGACAACATCTCGAGATGTTGTCAAAGAAGGGTTGC,n/a
mouse,353109,Scgb2b23-ps,NR_045685.1,TRCN0000363722,NM_004958.3-682s21c1,GCAACCCTTCTTTGACAACAT,pLKO_005,370,3UTR,90,89,,,Y,2475,MTOR,CCGGGCAACCCTTCTTTGACAACATCTCGAGATGTTGTCAAAGAAGGGTTGCTTTTTG,AATTCAAAAAGCAACCCTTCTTTGACAACATCTCGAGATGTTGTCAAAGAAGGGTTGC,n/a
mouse,353109,Scgb2b23-ps,NR_045685.1,TRCN0000120202,NM_053240.1-645s1c1,CCTTTCTCATTCAGTCTCTTT,pLKO.1,458,3UTR,85,89,,,Y,100504631,Vmn1r239-ps,CCGGCCTTTCTCATTCAGTCTCTTTCTCGAGAAAGAGACTGAATGAGAAAGGTTTTTG,AATTCAAAAACCTTTCTCATTCAGTCTCTTTCTCGAGAAAGAGACTGAATGAGAAAGG,n/a
mouse,353109,Scgb2b23-ps,NR_045685.1,TRCN0000372755,NM_000879.2-197s21c1,GATTCCTGTTCCTGTACATAA,pLKO_005,442,3UTR,80,89,,,Y,3567,IL5,CCGGGATTCCTGTTCCTGTACATAACTCGAGTTATGTACAGGAACAGGAATCTTTTTG,AATTCAAAAAGATTCCTGTTCCTGTACATAACTCGAGTTATGTACAGGAACAGGAATC,n/a
mouse,353109,Scgb2b23-ps,NR_045685.1,TRCN0000425513,NM_027802.2-501s21c1,GTTACAAAGAGGGAGATTAAG,pLKO_005,205,3UTR,86,85,,,Y,71468,Obox1,CCGGGTTACAAAGAGGGAGATTAAGCTCGAGCTTAATCTCCCTCTTTGTAACTTTTTG,AATTCAAAAAGTTACAAAGAGGGAGATTAAGCTCGAGCTTAATCTCCCTCTTTGTAAC,n/a
mouse,353109,Scgb2b23-ps,NR_045685.1,TRCN0000046780,NM_145024.1-1663s1c1,GTCCTCTTTCTTCCTTAACTT,pLKO.1,419,3UTR,86,85,,,Y,221223,CES5A,CCGGGTCCTCTTTCTTCCTTAACTTCTCGAGAAGTTAAGGAAGAAAGAGGACTTTTTG,AATTCAAAAAGTCCTCTTTCTTCCTTAACTTCTCGAGAAGTTAAGGAAGAAAGAGGAC,n/a
mouse,353109,Scgb2b23-ps,NR_045685.1,TRCN0000429297,NM_029163.3-1460s21c1,TAAGAACTGCAGGCTTCAAAG,pLKO_005,141,3UTR,81,85,,,Y,75083,Usp50,CCGGTAAGAACTGCAGGCTTCAAAGCTCGAGCTTTGAAGCCTGCAGTTCTTATTTTTG,AATTCAAAAATAAGAACTGCAGGCTTCAAAGCTCGAGCTTTGAAGCCTGCAGTTCTTA,n/a
