Taxon,"Gene ID","Gene Symbol",Transcript,"Clone ID","Legacy Clone Name","Target Seq",Vector,"Match Position","Match Region","Match %","SDR Match %","Intrinsic Score","Adjusted Score","Matches Other Gene in Same Taxon?","Orig. Target Gene ID","Orig. Target Gene Symbol","Forward Oligo Sequence","Reverse Oligo Sequence",Addgene
mouse,69412,1700016L04Rik,NR_045824.1,TRCN0000431865,NM_027865.2-902s21c1,CCAATAACCTGAAACTGAATA,pLKO_005,793,3UTR,85,95,,,Y,71687,Tmem25,CCGGCCAATAACCTGAAACTGAATACTCGAGTATTCAGTTTCAGGTTATTGGTTTTTG,AATTCAAAAACCAATAACCTGAAACTGAATACTCGAGTATTCAGTTTCAGGTTATTGG,n/a
mouse,69412,1700016L04Rik,NR_045824.1,TRCN0000081685,NM_020287.1-528s1c1,GCTGGGTCTGAAGATCAAAGA,pLKO.1,62,3UTR,86,90,,,Y,56856,Insm2,CCGGGCTGGGTCTGAAGATCAAAGACTCGAGTCTTTGATCTTCAGACCCAGCTTTTTG,AATTCAAAAAGCTGGGTCTGAAGATCAAAGACTCGAGTCTTTGATCTTCAGACCCAGC,n/a
mouse,69412,1700016L04Rik,NR_045824.1,TRCN0000426503,NM_026286.3-1107s21c1,TCCATAAACCTGAACTGAAAT,pLKO_005,792,3UTR,81,90,,,Y,67634,Ftmt,CCGGTCCATAAACCTGAACTGAAATCTCGAGATTTCAGTTCAGGTTTATGGATTTTTG,AATTCAAAAATCCATAAACCTGAACTGAAATCTCGAGATTTCAGTTCAGGTTTATGGA,n/a
mouse,69412,1700016L04Rik,NR_045824.1,TRCN0000382219,NM_004305.2-1805s21c1,TTGAAGAGCAAAGGGAAATCA,pLKO_005,69,3UTR,81,90,,,Y,274,BIN1,CCGGTTGAAGAGCAAAGGGAAATCACTCGAGTGATTTCCCTTTGCTCTTCAATTTTTG,AATTCAAAAATTGAAGAGCAAAGGGAAATCACTCGAGTGATTTCCCTTTGCTCTTCAA,n/a
mouse,69412,1700016L04Rik,NR_045824.1,TRCN0000049147,XM_292596.1-324s1c1,CAACACAAATGGTTCCCAGTT,pLKO.1,246,3UTR,90,89,,,Y,342541,PPIAP55,CCGGCAACACAAATGGTTCCCAGTTCTCGAGAACTGGGAACCATTTGTGTTGTTTTTG,AATTCAAAAACAACACAAATGGTTCCCAGTTCTCGAGAACTGGGAACCATTTGTGTTG,n/a
mouse,69412,1700016L04Rik,NR_045824.1,TRCN0000146519,NM_178230.1-390s1c1,CAACACAAATGGTTCCCAGTT,pLKO.1,246,3UTR,90,89,,,Y,653505,PPIAL4A,CCGGCAACACAAATGGTTCCCAGTTCTCGAGAACTGGGAACCATTTGTGTTGTTTTTG,AATTCAAAAACAACACAAATGGTTCCCAGTTCTCGAGAACTGGGAACCATTTGTGTTG,n/a
mouse,69412,1700016L04Rik,NR_045824.1,TRCN0000016195,NM_022465.2-504s1c1,ACAGCGTGATTGTGGAAGATT,pLKO.1,399,3UTR,85,89,,,Y,64375,IKZF4,CCGGACAGCGTGATTGTGGAAGATTCTCGAGAATCTTCCACAATCACGCTGTTTTTTG,AATTCAAAAAACAGCGTGATTGTGGAAGATTCTCGAGAATCTTCCACAATCACGCTGT,n/a
mouse,69412,1700016L04Rik,NR_045824.1,TRCN0000274866,NM_022465.3-960s21c1,ACAGCGTGATTGTGGAAGATT,pLKO_005,399,3UTR,85,89,,,Y,64375,IKZF4,CCGGACAGCGTGATTGTGGAAGATTCTCGAGAATCTTCCACAATCACGCTGTTTTTTG,AATTCAAAAAACAGCGTGATTGTGGAAGATTCTCGAGAATCTTCCACAATCACGCTGT,n/a
mouse,69412,1700016L04Rik,NR_045824.1,TRCN0000175023,NM_146034.1-1006s1c1,GCTGATTTATGCAGCTAAGTT,pLKO.1,646,3UTR,85,89,,,Y,,,CCGGGCTGATTTATGCAGCTAAGTTCTCGAGAACTTAGCTGCATAAATCAGCTTTTTG,AATTCAAAAAGCTGATTTATGCAGCTAAGTTCTCGAGAACTTAGCTGCATAAATCAGC,n/a
mouse,69412,1700016L04Rik,NR_045824.1,TRCN0000292687,NM_146034.2-1000s21c1,GCTGATTTATGCAGCTAAGTT,pLKO_005,646,3UTR,85,89,,,Y,,,CCGGGCTGATTTATGCAGCTAAGTTCTCGAGAACTTAGCTGCATAAATCAGCTTTTTG,AATTCAAAAAGCTGATTTATGCAGCTAAGTTCTCGAGAACTTAGCTGCATAAATCAGC,n/a
mouse,69412,1700016L04Rik,NR_045824.1,TRCN0000111506,NM_033075.2-743s1c1,CCCATAACCTTACTTGGGTTA,pLKO.1,592,3UTR,85,89,,,Y,110956,D17H6S56E-5,CCGGCCCATAACCTTACTTGGGTTACTCGAGTAACCCAAGTAAGGTTATGGGTTTTTG,AATTCAAAAACCCATAACCTTACTTGGGTTACTCGAGTAACCCAAGTAAGGTTATGGG,n/a
mouse,69412,1700016L04Rik,NR_045824.1,TRCN0000064762,NM_198080.1-277s1c1,AGGAGAATACACACATCACAA,pLKO.1,169,3UTR,80,89,,,Y,253827,MSRB3,CCGGAGGAGAATACACACATCACAACTCGAGTTGTGATGTGTGTATTCTCCTTTTTTG,AATTCAAAAAAGGAGAATACACACATCACAACTCGAGTTGTGATGTGTGTATTCTCCT,n/a
mouse,69412,1700016L04Rik,NR_045824.1,TRCN0000154758,NM_173805.2-47s1c1,GAAGCAGGAGAACTCAGCTTT,pLKO.1,475,3UTR,80,89,,,Y,255180,GOLGA2P11,CCGGGAAGCAGGAGAACTCAGCTTTCTCGAGAAAGCTGAGTTCTCCTGCTTCTTTTTG,AATTCAAAAAGAAGCAGGAGAACTCAGCTTTCTCGAGAAAGCTGAGTTCTCCTGCTTC,n/a
mouse,69412,1700016L04Rik,NR_045824.1,TRCN0000122309,NM_032316.2-1346s1c1,CCTGAGCATAAGAACTGGGAT,pLKO.1,828,3UTR,80,89,,,Y,84276,NICN1,CCGGCCTGAGCATAAGAACTGGGATCTCGAGATCCCAGTTCTTATGCTCAGGTTTTTG,AATTCAAAAACCTGAGCATAAGAACTGGGATCTCGAGATCCCAGTTCTTATGCTCAGG,n/a
mouse,69412,1700016L04Rik,NR_045824.1,TRCN0000264188,NM_001085490.1-500s21c1,CACAGCTGCTTTATGCAATCT,pLKO_005,642,3UTR,80,89,,,Y,285501,LINC01098,CCGGCACAGCTGCTTTATGCAATCTCTCGAGAGATTGCATAAAGCAGCTGTGTTTTTG,AATTCAAAAACACAGCTGCTTTATGCAATCTCTCGAGAGATTGCATAAAGCAGCTGTG,n/a
mouse,69412,1700016L04Rik,NR_045824.1,TRCN0000203837,NM_146568.1-384s1c1,CCTGCTTTATGCTCAAGCTAT,pLKO.1,646,3UTR,81,85,,,Y,258561,Olfr1012,CCGGCCTGCTTTATGCTCAAGCTATCTCGAGATAGCTTGAGCATAAAGCAGGTTTTTG,AATTCAAAAACCTGCTTTATGCTCAAGCTATCTCGAGATAGCTTGAGCATAAAGCAGG,n/a
mouse,69412,1700016L04Rik,NR_045824.1,TRCN0000020685,NM_015265.1-1335s1c1,GCCATGCAGAATTTCCTCAAT,pLKO.1,382,3UTR,77,85,,,Y,23314,SATB2,CCGGGCCATGCAGAATTTCCTCAATCTCGAGATTGAGGAAATTCTGCATGGCTTTTTG,AATTCAAAAAGCCATGCAGAATTTCCTCAATCTCGAGATTGAGGAAATTCTGCATGGC,n/a
mouse,69412,1700016L04Rik,NR_045824.1,TRCN0000148675,NM_024078.1-1049s1c1,CTCTGTCTTTCACGTCAAGTA,pLKO.1,427,3UTR,77,85,,,Y,79050,NOC4L,CCGGCTCTGTCTTTCACGTCAAGTACTCGAGTACTTGACGTGAAAGACAGAGTTTTTG,AATTCAAAAACTCTGTCTTTCACGTCAAGTACTCGAGTACTTGACGTGAAAGACAGAG,n/a
