Taxon,"Gene ID","Gene Symbol",Transcript,"Clone ID","Legacy Clone Name","Target Seq",Vector,"Match Position","Match Region","Match %","SDR Match %","Intrinsic Score","Adjusted Score","Matches Other Gene in Same Taxon?","Orig. Target Gene ID","Orig. Target Gene Symbol","Forward Oligo Sequence","Reverse Oligo Sequence",Addgene
human,152816,ODAPH,NR_046429.2,TRCN0000377729,NM_178497.2-154s21c1,CTACCGACTGCCAGATCTTTA,pLKO_005,291,3UTR,100,100,13.2,18.48,N,152816,ODAPH,CCGGCTACCGACTGCCAGATCTTTACTCGAGTAAAGATCTGGCAGTCGGTAGTTTTTG,AATTCAAAAACTACCGACTGCCAGATCTTTACTCGAGTAAAGATCTGGCAGTCGGTAG,n/a
human,152816,ODAPH,NR_046429.2,TRCN0000136597,NM_178497.2-62s1c1,CTGGTTACTGGTATGCTGGTT,pLKO.1,44,3UTR,100,100,2.64,2.112,N,152816,ODAPH,CCGGCTGGTTACTGGTATGCTGGTTCTCGAGAACCAGCATACCAGTAACCAGTTTTTG,AATTCAAAAACTGGTTACTGGTATGCTGGTTCTCGAGAACCAGCATACCAGTAACCAG,n/a
human,152816,ODAPH,NR_046429.2,TRCN0000134792,NM_178497.2-578s1c1,CTTTGTCAGCAGTGAAGATAT,pLKO.1,580,3UTR,100,100,13.2,9.24,N,152816,ODAPH,CCGGCTTTGTCAGCAGTGAAGATATCTCGAGATATCTTCACTGCTGACAAAGTTTTTG,AATTCAAAAACTTTGTCAGCAGTGAAGATATCTCGAGATATCTTCACTGCTGACAAAG,n/a
human,152816,ODAPH,NR_046429.2,TRCN0000135027,NM_178497.2-555s1c1,CATCACTGACTAGAAACTGTT,pLKO.1,557,3UTR,100,100,4.95,3.465,N,152816,ODAPH,CCGGCATCACTGACTAGAAACTGTTCTCGAGAACAGTTTCTAGTCAGTGATGTTTTTG,AATTCAAAAACATCACTGACTAGAAACTGTTCTCGAGAACAGTTTCTAGTCAGTGATG,n/a
human,152816,ODAPH,NR_046429.2,TRCN0000136211,NM_178497.2-573s1c1,GTTCTCTTTGTCAGCAGTGAA,pLKO.1,575,3UTR,100,100,4.95,3.465,N,152816,ODAPH,CCGGGTTCTCTTTGTCAGCAGTGAACTCGAGTTCACTGCTGACAAAGAGAACTTTTTG,AATTCAAAAAGTTCTCTTTGTCAGCAGTGAACTCGAGTTCACTGCTGACAAAGAGAAC,n/a
human,152816,ODAPH,NR_046429.2,TRCN0000137402,NM_178497.2-403s1c1,GAGGAAGCTCATCTGAGGAAA,pLKO.1,405,3UTR,100,100,4.95,2.97,N,152816,ODAPH,CCGGGAGGAAGCTCATCTGAGGAAACTCGAGTTTCCTCAGATGAGCTTCCTCTTTTTG,AATTCAAAAAGAGGAAGCTCATCTGAGGAAACTCGAGTTTCCTCAGATGAGCTTCCTC,n/a
human,152816,ODAPH,NR_046429.2,TRCN0000116227,NM_024930.1-2895s1c1,CCTCCCAAAGTTCTGGGATTA,pLKO.1,174,3UTR,100,100,1.08,.54,Y,79993,ELOVL7,CCGGCCTCCCAAAGTTCTGGGATTACTCGAGTAATCCCAGAACTTTGGGAGGTTTTTG,AATTCAAAAACCTCCCAAAGTTCTGGGATTACTCGAGTAATCCCAGAACTTTGGGAGG,n/a
human,152816,ODAPH,NR_046429.2,TRCN0000164591,NM_003281.3-2102s1c1,CCTCCCAAAGTTCTGGGATTA,pLKO.1,174,3UTR,100,100,1.08,.54,Y,7135,TNNI1,CCGGCCTCCCAAAGTTCTGGGATTACTCGAGTAATCCCAGAACTTTGGGAGGTTTTTG,AATTCAAAAACCTCCCAAAGTTCTGGGATTACTCGAGTAATCCCAGAACTTTGGGAGG,n/a
human,152816,ODAPH,NR_046429.2,TRCN0000116737,NM_016369.3-2405s1c1,CCTCCCAAGTAGCTGGAATTA,pLKO.1,1107,3UTR,95,95,,,Y,51208,CLDN18,CCGGCCTCCCAAGTAGCTGGAATTACTCGAGTAATTCCAGCTACTTGGGAGGTTTTTG,AATTCAAAAACCTCCCAAGTAGCTGGAATTACTCGAGTAATTCCAGCTACTTGGGAGG,n/a
human,152816,ODAPH,NR_046429.2,TRCN0000165774,NM_001012391.1-946s1c1,CCTCCTAAGTAGCTGGGATTA,pLKO.1,1107,3UTR,95,95,,,Y,100652781,SNX29P1,CCGGCCTCCTAAGTAGCTGGGATTACTCGAGTAATCCCAGCTACTTAGGAGGTTTTTG,AATTCAAAAACCTCCTAAGTAGCTGGGATTACTCGAGTAATCCCAGCTACTTAGGAGG,n/a
human,152816,ODAPH,NR_046429.2,TRCN0000060503,NM_001001414.1-1521s1c1,CCTCTCAAGTAGCTGGGATTA,pLKO.1,1107,3UTR,95,95,,,Y,342897,NCCRP1,CCGGCCTCTCAAGTAGCTGGGATTACTCGAGTAATCCCAGCTACTTGAGAGGTTTTTG,AATTCAAAAACCTCTCAAGTAGCTGGGATTACTCGAGTAATCCCAGCTACTTGAGAGG,n/a
human,152816,ODAPH,NR_046429.2,TRCN0000155576,NM_198582.1-3137s1c1,CCTCTCAAGTAGCTGGGATTA,pLKO.1,1107,3UTR,95,95,,,Y,377007,KLHL30,CCGGCCTCTCAAGTAGCTGGGATTACTCGAGTAATCCCAGCTACTTGAGAGGTTTTTG,AATTCAAAAACCTCTCAAGTAGCTGGGATTACTCGAGTAATCCCAGCTACTTGAGAGG,n/a
human,152816,ODAPH,NR_046429.2,TRCN0000165697,NM_017842.1-943s1c1,CCTCTCAAGTAGCTGGGATTA,pLKO.1,1107,3UTR,95,95,,,Y,55652,SLC48A1,CCGGCCTCTCAAGTAGCTGGGATTACTCGAGTAATCCCAGCTACTTGAGAGGTTTTTG,AATTCAAAAACCTCTCAAGTAGCTGGGATTACTCGAGTAATCCCAGCTACTTGAGAGG,n/a
human,152816,ODAPH,NR_046429.2,TRCN0000138395,XM_374933.1-1847s1c1,CCTTCCAAGTAGCTGGGATTA,pLKO.1,1107,3UTR,95,95,,,Y,399949,C11orf88,CCGGCCTTCCAAGTAGCTGGGATTACTCGAGTAATCCCAGCTACTTGGAAGGTTTTTG,AATTCAAAAACCTTCCAAGTAGCTGGGATTACTCGAGTAATCCCAGCTACTTGGAAGG,n/a
human,152816,ODAPH,NR_046429.2,TRCN0000148469,NM_152459.2-1181s1c1,CTGGGTTCAAGCAATTCTCTT,pLKO.1,1079,3UTR,95,95,,,Y,146556,C16orf89,CCGGCTGGGTTCAAGCAATTCTCTTCTCGAGAAGAGAATTGCTTGAACCCAGTTTTTG,AATTCAAAAACTGGGTTCAAGCAATTCTCTTCTCGAGAAGAGAATTGCTTGAACCCAG,n/a
human,152816,ODAPH,NR_046429.2,TRCN0000165027,NM_001013636.1-513s1c1,GAACTCCTGACCTCAAGTGAT,pLKO.1,1209,3UTR,95,95,,,Y,387873,LOC387873,CCGGGAACTCCTGACCTCAAGTGATCTCGAGATCACTTGAGGTCAGGAGTTCTTTTTG,AATTCAAAAAGAACTCCTGACCTCAAGTGATCTCGAGATCACTTGAGGTCAGGAGTTC,n/a
human,152816,ODAPH,NR_046429.2,TRCN0000155187,NM_001003795.1-3305s1c1,GAGATGAGGTTTCACCATGTT,pLKO.1,1173,3UTR,95,95,,,Y,389524,GTF2IRD2B,CCGGGAGATGAGGTTTCACCATGTTCTCGAGAACATGGTGAAACCTCATCTCTTTTTG,AATTCAAAAAGAGATGAGGTTTCACCATGTTCTCGAGAACATGGTGAAACCTCATCTC,n/a
human,152816,ODAPH,NR_046429.2,TRCN0000168774,NM_001013670.1-1394s1c1,GAGATGGAGTTTCACCATGTT,pLKO.1,1173,3UTR,95,95,,,Y,400464,LOC400464,CCGGGAGATGGAGTTTCACCATGTTCTCGAGAACATGGTGAAACTCCATCTCTTTTTG,AATTCAAAAAGAGATGGAGTTTCACCATGTTCTCGAGAACATGGTGAAACTCCATCTC,n/a
human,152816,ODAPH,NR_046429.2,TRCN0000164801,NM_016534.2-1646s1c1,CCTCCCAAAGTACTGGGATTA,pLKO.1,174,3UTR,95,95,,,Y,51275,MAPKAPK5-AS1,CCGGCCTCCCAAAGTACTGGGATTACTCGAGTAATCCCAGTACTTTGGGAGGTTTTTG,AATTCAAAAACCTCCCAAAGTACTGGGATTACTCGAGTAATCCCAGTACTTTGGGAGG,n/a
human,152816,ODAPH,NR_046429.2,TRCN0000057398,NM_002261.1-793s1c1,CCTCCCAAGTTGCTGGGATTA,pLKO.1,1107,3UTR,95,95,,,Y,3823,KLRC3,CCGGCCTCCCAAGTTGCTGGGATTACTCGAGTAATCCCAGCAACTTGGGAGGTTTTTG,AATTCAAAAACCTCCCAAGTTGCTGGGATTACTCGAGTAATCCCAGCAACTTGGGAGG,n/a
human,152816,ODAPH,NR_046429.2,TRCN0000091448,NM_013513.1-2495s1c1,CCTCCCAAGTACTGGGATTAA,pLKO.1,1107,3UTR,90,95,,,Y,13828,Epb42,CCGGCCTCCCAAGTACTGGGATTAACTCGAGTTAATCCCAGTACTTGGGAGGTTTTTG,AATTCAAAAACCTCCCAAGTACTGGGATTAACTCGAGTTAATCCCAGTACTTGGGAGG,n/a
human,152816,ODAPH,NR_046429.2,TRCN0000155836,NM_198582.1-3275s1c1,CCCAAAGTGCTGGGATTACAA,pLKO.1,177,3UTR,90,95,,,Y,377007,KLHL30,CCGGCCCAAAGTGCTGGGATTACAACTCGAGTTGTAATCCCAGCACTTTGGGTTTTTG,AATTCAAAAACCCAAAGTGCTGGGATTACAACTCGAGTTGTAATCCCAGCACTTTGGG,n/a
human,152816,ODAPH,NR_046429.2,TRCN0000010313,NM_007194.x-2219s1c1,TCAGGATGAAGACATGAAGAG,pLKO.1,1763,3UTR,90,95,,,Y,11200,CHEK2,CCGGTCAGGATGAAGACATGAAGAGCTCGAGCTCTTCATGTCTTCATCCTGATTTTTG,AATTCAAAAATCAGGATGAAGACATGAAGAGCTCGAGCTCTTCATGTCTTCATCCTGA,n/a
human,152816,ODAPH,NR_046429.2,TRCN0000141025,NM_152361.1-835s1c1,CCCAAAGTGCTGGGATTACTT,pLKO.1,177,3UTR,85,95,,,Y,126272,EID2B,CCGGCCCAAAGTGCTGGGATTACTTCTCGAGAAGTAATCCCAGCACTTTGGGTTTTTG,AATTCAAAAACCCAAAGTGCTGGGATTACTTCTCGAGAAGTAATCCCAGCACTTTGGG,n/a
human,152816,ODAPH,NR_046429.2,TRCN0000190964,NM_178605.2-913s1c1,CCTCTCAAGTGCTGGGATTAA,pLKO.1,1107,3UTR,86,90,,,Y,28126,Nop16,CCGGCCTCTCAAGTGCTGGGATTAACTCGAGTTAATCCCAGCACTTGAGAGGTTTTTG,AATTCAAAAACCTCTCAAGTGCTGGGATTAACTCGAGTTAATCCCAGCACTTGAGAGG,n/a
human,152816,ODAPH,NR_046429.2,TRCN0000176563,NM_023480.1-558s1c1,CATCATCAGCTATGTTTCTAA,pLKO.1,1824,3UTR,81,90,,,Y,68636,Fahd1,CCGGCATCATCAGCTATGTTTCTAACTCGAGTTAGAAACATAGCTGATGATGTTTTTG,AATTCAAAAACATCATCAGCTATGTTTCTAACTCGAGTTAGAAACATAGCTGATGATG,n/a
human,152816,ODAPH,NR_046429.2,TRCN0000337966,NM_023480.2-724s21c1,CATCATCAGCTATGTTTCTAA,pLKO_005,1824,3UTR,81,90,,,Y,68636,Fahd1,CCGGCATCATCAGCTATGTTTCTAACTCGAGTTAGAAACATAGCTGATGATGTTTTTG,AATTCAAAAACATCATCAGCTATGTTTCTAACTCGAGTTAGAAACATAGCTGATGATG,n/a
human,152816,ODAPH,NR_046429.2,TRCN0000148484,NM_080669.2-1162s1c1,CCTCTCATGTTCACAGGATAT,pLKO.1,662,3UTR,90,89,,,Y,113235,SLC46A1,CCGGCCTCTCATGTTCACAGGATATCTCGAGATATCCTGTGAACATGAGAGGTTTTTG,AATTCAAAAACCTCTCATGTTCACAGGATATCTCGAGATATCCTGTGAACATGAGAGG,n/a
human,152816,ODAPH,NR_046429.2,TRCN0000139587,NM_052966.1-4502s1c1,CGTCCCAAGTAGCTGGAATTA,pLKO.1,1107,3UTR,90,89,,,Y,116496,NIBAN1,CCGGCGTCCCAAGTAGCTGGAATTACTCGAGTAATTCCAGCTACTTGGGACGTTTTTG,AATTCAAAAACGTCCCAAGTAGCTGGAATTACTCGAGTAATTCCAGCTACTTGGGACG,n/a
human,152816,ODAPH,NR_046429.2,TRCN0000150833,NM_207309.1-2994s1c1,GCCTGGCTAATTCTTTGTATT,pLKO.1,1145,3UTR,90,89,,,Y,91373,UAP1L1,CCGGGCCTGGCTAATTCTTTGTATTCTCGAGAATACAAAGAATTAGCCAGGCTTTTTG,AATTCAAAAAGCCTGGCTAATTCTTTGTATTCTCGAGAATACAAAGAATTAGCCAGGC,n/a
human,152816,ODAPH,NR_046429.2,TRCN0000140610,NM_025042.2-931s1c1,GCCTCTCAGGTTCAAGCAATT,pLKO.1,1074,3UTR,90,89,,,Y,,,CCGGGCCTCTCAGGTTCAAGCAATTCTCGAGAATTGCTTGAACCTGAGAGGCTTTTTG,AATTCAAAAAGCCTCTCAGGTTCAAGCAATTCTCGAGAATTGCTTGAACCTGAGAGGC,n/a
human,152816,ODAPH,NR_046429.2,TRCN0000412542,NM_030973.2-1273s21c1,AGTGGCAAGAGAAACCCAAAC,pLKO_005,430,3UTR,90,89,,,Y,81857,MED25,CCGGAGTGGCAAGAGAAACCCAAACCTCGAGGTTTGGGTTTCTCTTGCCACTTTTTTG,AATTCAAAAAAGTGGCAAGAGAAACCCAAACCTCGAGGTTTGGGTTTCTCTTGCCACT,n/a
human,152816,ODAPH,NR_046429.2,TRCN0000204533,NM_001013675.1-1987s1c1,CCTCCCAAAGTGCTGGAATTA,pLKO.1,174,3UTR,90,89,,,Y,400891,LRRC74B,CCGGCCTCCCAAAGTGCTGGAATTACTCGAGTAATTCCAGCACTTTGGGAGGTTTTTG,AATTCAAAAACCTCCCAAAGTGCTGGAATTACTCGAGTAATTCCAGCACTTTGGGAGG,n/a
human,152816,ODAPH,NR_046429.2,TRCN0000121422,NM_172859.1-2893s1c1,CCTCCGAAGTAGCTGAGATTA,pLKO.1,1107,3UTR,90,89,,,Y,241688,Dzank1,CCGGCCTCCGAAGTAGCTGAGATTACTCGAGTAATCTCAGCTACTTCGGAGGTTTTTG,AATTCAAAAACCTCCGAAGTAGCTGAGATTACTCGAGTAATCTCAGCTACTTCGGAGG,n/a
human,152816,ODAPH,NR_046429.2,TRCN0000072628,NM_016065.3-1636s1c1,CCTCCCAAAGTGCTAGGATTA,pLKO.1,174,3UTR,90,89,,,Y,51021,MRPS16,CCGGCCTCCCAAAGTGCTAGGATTACTCGAGTAATCCTAGCACTTTGGGAGGTTTTTG,AATTCAAAAACCTCCCAAAGTGCTAGGATTACTCGAGTAATCCTAGCACTTTGGGAGG,n/a
human,152816,ODAPH,NR_046429.2,TRCN0000165534,NM_001012717.1-362s1c1,GAGACAGGGTTTCACCATGTT,pLKO.1,1173,3UTR,90,89,,,Y,,,CCGGGAGACAGGGTTTCACCATGTTCTCGAGAACATGGTGAAACCCTGTCTCTTTTTG,AATTCAAAAAGAGACAGGGTTTCACCATGTTCTCGAGAACATGGTGAAACCCTGTCTC,n/a
human,152816,ODAPH,NR_046429.2,TRCN0000073773,NM_022164.1-1914s1c1,CCTCTCAAGTAGCTGGGACTA,pLKO.1,1107,3UTR,90,89,,,Y,64129,TINAGL1,CCGGCCTCTCAAGTAGCTGGGACTACTCGAGTAGTCCCAGCTACTTGAGAGGTTTTTG,AATTCAAAAACCTCTCAAGTAGCTGGGACTACTCGAGTAGTCCCAGCTACTTGAGAGG,n/a
human,152816,ODAPH,NR_046429.2,TRCN0000129739,NM_152410.1-932s1c1,CTCTCAAGTAGCTGAGATTAT,pLKO.1,1108,3UTR,90,89,,,Y,135138,PACRG,CCGGCTCTCAAGTAGCTGAGATTATCTCGAGATAATCTCAGCTACTTGAGAGTTTTTG,AATTCAAAAACTCTCAAGTAGCTGAGATTATCTCGAGATAATCTCAGCTACTTGAGAG,n/a
human,152816,ODAPH,NR_046429.2,TRCN0000008902,NM_016540.2-2291s1c1,CCTCCCAAAGTGTTGGGATTA,pLKO.1,174,3UTR,90,89,,,Y,10888,GPR83,CCGGCCTCCCAAAGTGTTGGGATTACTCGAGTAATCCCAACACTTTGGGAGGTTTTTG,AATTCAAAAACCTCCCAAAGTGTTGGGATTACTCGAGTAATCCCAACACTTTGGGAGG,n/a
human,152816,ODAPH,NR_046429.2,TRCN0000156315,NM_020702.1-3633s1c1,CCTCCCAAAGTGTTGGGATTA,pLKO.1,174,3UTR,90,89,,,Y,57462,MYORG,CCGGCCTCCCAAAGTGTTGGGATTACTCGAGTAATCCCAACACTTTGGGAGGTTTTTG,AATTCAAAAACCTCCCAAAGTGTTGGGATTACTCGAGTAATCCCAACACTTTGGGAGG,n/a
human,152816,ODAPH,NR_046429.2,TRCN0000163829,NM_173639.1-1102s1c1,CCTCCCAAATTACTGGGATTA,pLKO.1,174,3UTR,90,89,,,Y,284618,RUSC1-AS1,CCGGCCTCCCAAATTACTGGGATTACTCGAGTAATCCCAGTAATTTGGGAGGTTTTTG,AATTCAAAAACCTCCCAAATTACTGGGATTACTCGAGTAATCCCAGTAATTTGGGAGG,n/a
human,152816,ODAPH,NR_046429.2,TRCN0000040213,NM_000618.2-6169s1c1,CCTCCCAAATTGCTGGGATTA,pLKO.1,174,3UTR,90,89,,,Y,3479,IGF1,CCGGCCTCCCAAATTGCTGGGATTACTCGAGTAATCCCAGCAATTTGGGAGGTTTTTG,AATTCAAAAACCTCCCAAATTGCTGGGATTACTCGAGTAATCCCAGCAATTTGGGAGG,n/a
human,152816,ODAPH,NR_046429.2,TRCN0000140374,NM_025042.2-1098s1c1,GCTTCCCAAAGTACTGGGATT,pLKO.1,173,3UTR,90,89,,,Y,,,CCGGGCTTCCCAAAGTACTGGGATTCTCGAGAATCCCAGTACTTTGGGAAGCTTTTTG,AATTCAAAAAGCTTCCCAAAGTACTGGGATTCTCGAGAATCCCAGTACTTTGGGAAGC,n/a
human,152816,ODAPH,NR_046429.2,TRCN0000373347,NM_030916.2-1717s21c1,ATCAGGATGAAGGCATCAAAC,pLKO_005,1762,3UTR,85,89,,,Y,81607,NECTIN4,CCGGATCAGGATGAAGGCATCAAACCTCGAGGTTTGATGCCTTCATCCTGATTTTTTG,AATTCAAAAAATCAGGATGAAGGCATCAAACCTCGAGGTTTGATGCCTTCATCCTGAT,n/a
human,152816,ODAPH,NR_046429.2,TRCN0000382140,NM_003916.3-1109s21c1,TGACAAAGGAAACTCTTAAAT,pLKO_005,868,3UTR,85,89,,,Y,8905,AP1S2,CCGGTGACAAAGGAAACTCTTAAATCTCGAGATTTAAGAGTTTCCTTTGTCATTTTTG,AATTCAAAAATGACAAAGGAAACTCTTAAATCTCGAGATTTAAGAGTTTCCTTTGTCA,n/a
human,152816,ODAPH,NR_046429.2,TRCN0000162795,NM_017842.1-1079s1c1,CTTCCAAAGTGCTGGGATTAT,pLKO.1,175,3UTR,85,89,,,Y,55652,SLC48A1,CCGGCTTCCAAAGTGCTGGGATTATCTCGAGATAATCCCAGCACTTTGGAAGTTTTTG,AATTCAAAAACTTCCAAAGTGCTGGGATTATCTCGAGATAATCCCAGCACTTTGGAAG,n/a
human,152816,ODAPH,NR_046429.2,TRCN0000337418,NM_001114403.1-1038s21c1,CCTCACGGGTTCAAGCGATTT,pLKO_005,1075,3UTR,85,89,,,Y,100134938,UPK3BL1,CCGGCCTCACGGGTTCAAGCGATTTCTCGAGAAATCGCTTGAACCCGTGAGGTTTTTG,AATTCAAAAACCTCACGGGTTCAAGCGATTTCTCGAGAAATCGCTTGAACCCGTGAGG,n/a
human,152816,ODAPH,NR_046429.2,TRCN0000140657,NM_012099.1-2957s1c1,CCTCCCAAAGTGCTAGGATAA,pLKO.1,174,3UTR,85,89,,,Y,10849,CD3EAP,CCGGCCTCCCAAAGTGCTAGGATAACTCGAGTTATCCTAGCACTTTGGGAGGTTTTTG,AATTCAAAAACCTCCCAAAGTGCTAGGATAACTCGAGTTATCCTAGCACTTTGGGAGG,n/a
human,152816,ODAPH,NR_046429.2,TRCN0000139610,NM_032120.1-1494s1c1,CGAACTCCTGACCTTGTGATA,pLKO.1,141,3UTR,85,89,,,Y,84060,RBM48,CCGGCGAACTCCTGACCTTGTGATACTCGAGTATCACAAGGTCAGGAGTTCGTTTTTG,AATTCAAAAACGAACTCCTGACCTTGTGATACTCGAGTATCACAAGGTCAGGAGTTCG,n/a
human,152816,ODAPH,NR_046429.2,TRCN0000082508,XM_373815.2-389s1c1,GCTGGAGTGTAGTAGTGCTAT,pLKO.1,1033,3UTR,85,89,,,Y,388573,LOC388573,CCGGGCTGGAGTGTAGTAGTGCTATCTCGAGATAGCACTACTACACTCCAGCTTTTTG,AATTCAAAAAGCTGGAGTGTAGTAGTGCTATCTCGAGATAGCACTACTACACTCCAGC,n/a
human,152816,ODAPH,NR_046429.2,TRCN0000264189,NM_001085490.1-613s21c1,CAAGTAGCTGGGACTACAGGA,pLKO_005,1112,3UTR,85,89,,,Y,285501,LINC01098,CCGGCAAGTAGCTGGGACTACAGGACTCGAGTCCTGTAGTCCCAGCTACTTGTTTTTG,AATTCAAAAACAAGTAGCTGGGACTACAGGACTCGAGTCCTGTAGTCCCAGCTACTTG,n/a
human,152816,ODAPH,NR_046429.2,TRCN0000098494,NM_027157.1-401s1c1,CTGTTGCTGCTACTGCTGCTA,pLKO.1,1725,3UTR,85,89,,,Y,69664,Krtap1-5,CCGGCTGTTGCTGCTACTGCTGCTACTCGAGTAGCAGCAGTAGCAGCAACAGTTTTTG,AATTCAAAAACTGTTGCTGCTACTGCTGCTACTCGAGTAGCAGCAGTAGCAGCAACAG,n/a
human,152816,ODAPH,NR_046429.2,TRCN0000114786,NM_010917.1-4099s1c1,GCCAATTATCTTGTCTGTATA,pLKO.1,1631,3UTR,80,89,,,Y,18073,Nid1,CCGGGCCAATTATCTTGTCTGTATACTCGAGTATACAGACAAGATAATTGGCTTTTTG,AATTCAAAAAGCCAATTATCTTGTCTGTATACTCGAGTATACAGACAAGATAATTGGC,n/a
human,152816,ODAPH,NR_046429.2,TRCN0000320018,NM_010917.2-4190s21c1,GCCAATTATCTTGTCTGTATA,pLKO_005,1631,3UTR,80,89,,,Y,18073,Nid1,CCGGGCCAATTATCTTGTCTGTATACTCGAGTATACAGACAAGATAATTGGCTTTTTG,AATTCAAAAAGCCAATTATCTTGTCTGTATACTCGAGTATACAGACAAGATAATTGGC,n/a
human,152816,ODAPH,NR_046429.2,TRCN0000427450,NM_144581.1-969s21c1,AGCTGTGAGGGAAGCGAAATG,pLKO_005,425,3UTR,80,89,,,Y,112849,L3HYPDH,CCGGAGCTGTGAGGGAAGCGAAATGCTCGAGCATTTCGCTTCCCTCACAGCTTTTTTG,AATTCAAAAAAGCTGTGAGGGAAGCGAAATGCTCGAGCATTTCGCTTCCCTCACAGCT,n/a
human,152816,ODAPH,NR_046429.2,TRCN0000168807,NM_178520.2-2253s1c1,GCTGATCTCAAACTCCTGATA,pLKO.1,1200,3UTR,80,89,,,Y,284186,TMEM105,CCGGGCTGATCTCAAACTCCTGATACTCGAGTATCAGGAGTTTGAGATCAGCTTTTTG,AATTCAAAAAGCTGATCTCAAACTCCTGATACTCGAGTATCAGGAGTTTGAGATCAGC,n/a
human,152816,ODAPH,NR_046429.2,TRCN0000153362,NM_033130.2-480s1c1,GAGAGGAAGCTATGTGAGATA,pLKO.1,403,3UTR,81,85,,,Y,89790,SIGLEC10,CCGGGAGAGGAAGCTATGTGAGATACTCGAGTATCTCACATAGCTTCCTCTCTTTTTG,AATTCAAAAAGAGAGGAAGCTATGTGAGATACTCGAGTATCTCACATAGCTTCCTCTC,n/a
