Taxon,"Gene ID","Gene Symbol",Transcript,"Clone ID","Legacy Clone Name","Target Seq",Vector,"Match Position","Match Region","Match %","SDR Match %","Intrinsic Score","Adjusted Score","Matches Other Gene in Same Taxon?","Orig. Target Gene ID","Orig. Target Gene Symbol","Forward Oligo Sequence","Reverse Oligo Sequence",Addgene
human,219743,TYSND1,NR_073593.2,TRCN0000165948,NM_173555.1-2269s1c1,GCAGAAACCTTGCTCTGAAGA,pLKO.1,959,3UTR,100,100,4.95,3.465,N,219743,TYSND1,CCGGGCAGAAACCTTGCTCTGAAGACTCGAGTCTTCAGAGCAAGGTTTCTGCTTTTTG,AATTCAAAAAGCAGAAACCTTGCTCTGAAGACTCGAGTCTTCAGAGCAAGGTTTCTGC,n/a
human,219743,TYSND1,NR_073593.2,TRCN0000165526,NM_173555.1-1798s1c1,GCTGTGTTACCACCTTTGGAA,pLKO.1,488,3UTR,100,100,3,2.1,N,219743,TYSND1,CCGGGCTGTGTTACCACCTTTGGAACTCGAGTTCCAAAGGTGGTAACACAGCTTTTTG,AATTCAAAAAGCTGTGTTACCACCTTTGGAACTCGAGTTCCAAAGGTGGTAACACAGC,n/a
human,219743,TYSND1,NR_073593.2,TRCN0000166476,NM_173555.1-2291s1c1,CAGAGACAGAAGGGACAGAAA,pLKO.1,981,3UTR,100,100,4.95,2.97,N,219743,TYSND1,CCGGCAGAGACAGAAGGGACAGAAACTCGAGTTTCTGTCCCTTCTGTCTCTGTTTTTG,AATTCAAAAACAGAGACAGAAGGGACAGAAACTCGAGTTTCTGTCCCTTCTGTCTCTG,n/a
human,219743,TYSND1,NR_073593.2,TRCN0000155836,NM_198582.1-3275s1c1,CCCAAAGTGCTGGGATTACAA,pLKO.1,1551,3UTR,95,100,5.625,2.8125,Y,377007,KLHL30,CCGGCCCAAAGTGCTGGGATTACAACTCGAGTTGTAATCCCAGCACTTTGGGTTTTTG,AATTCAAAAACCCAAAGTGCTGGGATTACAACTCGAGTTGTAATCCCAGCACTTTGGG,n/a
human,219743,TYSND1,NR_073593.2,TRCN0000141025,NM_152361.1-835s1c1,CCCAAAGTGCTGGGATTACTT,pLKO.1,1551,3UTR,90,100,5.625,2.8125,Y,126272,EID2B,CCGGCCCAAAGTGCTGGGATTACTTCTCGAGAAGTAATCCCAGCACTTTGGGTTTTTG,AATTCAAAAACCCAAAGTGCTGGGATTACTTCTCGAGAAGTAATCCCAGCACTTTGGG,n/a
human,219743,TYSND1,NR_073593.2,TRCN0000139826,NM_133477.1-4628s1c1,CCTCCTGAATAGCTGGGATTA,pLKO.1,1415,3UTR,95,95,,,Y,171024,SYNPO2,CCGGCCTCCTGAATAGCTGGGATTACTCGAGTAATCCCAGCTATTCAGGAGGTTTTTG,AATTCAAAAACCTCCTGAATAGCTGGGATTACTCGAGTAATCCCAGCTATTCAGGAGG,n/a
human,219743,TYSND1,NR_073593.2,TRCN0000140374,NM_025042.2-1098s1c1,GCTTCCCAAAGTACTGGGATT,pLKO.1,1547,3UTR,95,95,,,Y,,,CCGGGCTTCCCAAAGTACTGGGATTCTCGAGAATCCCAGTACTTTGGGAAGCTTTTTG,AATTCAAAAAGCTTCCCAAAGTACTGGGATTCTCGAGAATCCCAGTACTTTGGGAAGC,n/a
human,219743,TYSND1,NR_073593.2,TRCN0000089693,NM_172612.1-1838s1c1,GCTTCCTAAGTGCTGGGATTA,pLKO.1,1547,3UTR,90,90,,,Y,223881,Rnd1,CCGGGCTTCCTAAGTGCTGGGATTACTCGAGTAATCCCAGCACTTAGGAAGCTTTTTG,AATTCAAAAAGCTTCCTAAGTGCTGGGATTACTCGAGTAATCCCAGCACTTAGGAAGC,n/a
human,219743,TYSND1,NR_073593.2,TRCN0000139641,NM_014667.1-1306s1c1,CCTGCCTCAGTTACCAAAGAA,pLKO.1,1538,3UTR,81,90,,,Y,9686,VGLL4,CCGGCCTGCCTCAGTTACCAAAGAACTCGAGTTCTTTGGTAACTGAGGCAGGTTTTTG,AATTCAAAAACCTGCCTCAGTTACCAAAGAACTCGAGTTCTTTGGTAACTGAGGCAGG,n/a
human,219743,TYSND1,NR_073593.2,TRCN0000078633,NM_032214.2-1896s1c1,CCTCCAGAATAGCTGGGATTA,pLKO.1,1415,3UTR,90,89,,,Y,84174,SLA2,CCGGCCTCCAGAATAGCTGGGATTACTCGAGTAATCCCAGCTATTCTGGAGGTTTTTG,AATTCAAAAACCTCCAGAATAGCTGGGATTACTCGAGTAATCCCAGCTATTCTGGAGG,n/a
human,219743,TYSND1,NR_073593.2,TRCN0000129154,NM_017760.4-4749s1c1,GCTTCTCAAATTGCTGGGATT,pLKO.1,1547,3UTR,90,89,,,Y,54892,NCAPG2,CCGGGCTTCTCAAATTGCTGGGATTCTCGAGAATCCCAGCAATTTGAGAAGCTTTTTG,AATTCAAAAAGCTTCTCAAATTGCTGGGATTCTCGAGAATCCCAGCAATTTGAGAAGC,n/a
human,219743,TYSND1,NR_073593.2,TRCN0000430981,NM_173537.2-3266s21c1,GCCACCATGCCTGGCTAATTT,pLKO_005,1445,3UTR,90,89,,,Y,84163,GTF2IRD2,CCGGGCCACCATGCCTGGCTAATTTCTCGAGAAATTAGCCAGGCATGGTGGCTTTTTG,AATTCAAAAAGCCACCATGCCTGGCTAATTTCTCGAGAAATTAGCCAGGCATGGTGGC,n/a
human,219743,TYSND1,NR_073593.2,TRCN0000204533,NM_001013675.1-1987s1c1,CCTCCCAAAGTGCTGGAATTA,pLKO.1,1548,3UTR,90,89,,,Y,400891,LRRC74B,CCGGCCTCCCAAAGTGCTGGAATTACTCGAGTAATTCCAGCACTTTGGGAGGTTTTTG,AATTCAAAAACCTCCCAAAGTGCTGGAATTACTCGAGTAATTCCAGCACTTTGGGAGG,n/a
human,219743,TYSND1,NR_073593.2,TRCN0000072628,NM_016065.3-1636s1c1,CCTCCCAAAGTGCTAGGATTA,pLKO.1,1548,3UTR,90,89,,,Y,51021,MRPS16,CCGGCCTCCCAAAGTGCTAGGATTACTCGAGTAATCCTAGCACTTTGGGAGGTTTTTG,AATTCAAAAACCTCCCAAAGTGCTAGGATTACTCGAGTAATCCTAGCACTTTGGGAGG,n/a
human,219743,TYSND1,NR_073593.2,TRCN0000130981,NM_152906.2-1811s1c1,CCTCCTGATTAGCTGGGATTA,pLKO.1,1415,3UTR,90,89,,,Y,128989,TANGO2,CCGGCCTCCTGATTAGCTGGGATTACTCGAGTAATCCCAGCTAATCAGGAGGTTTTTG,AATTCAAAAACCTCCTGATTAGCTGGGATTACTCGAGTAATCCCAGCTAATCAGGAGG,n/a
human,219743,TYSND1,NR_073593.2,TRCN0000156504,NM_201260.1-1037s1c1,CACAGTTCATTGCAGCCTCAA,pLKO.1,1362,3UTR,90,89,,,Y,131118,DNAJC19,CCGGCACAGTTCATTGCAGCCTCAACTCGAGTTGAGGCTGCAATGAACTGTGTTTTTG,AATTCAAAAACACAGTTCATTGCAGCCTCAACTCGAGTTGAGGCTGCAATGAACTGTG,n/a
human,219743,TYSND1,NR_073593.2,TRCN0000164801,NM_016534.2-1646s1c1,CCTCCCAAAGTACTGGGATTA,pLKO.1,1548,3UTR,90,89,,,Y,51275,MAPKAPK5-AS1,CCGGCCTCCCAAAGTACTGGGATTACTCGAGTAATCCCAGTACTTTGGGAGGTTTTTG,AATTCAAAAACCTCCCAAAGTACTGGGATTACTCGAGTAATCCCAGTACTTTGGGAGG,n/a
human,219743,TYSND1,NR_073593.2,TRCN0000008902,NM_016540.2-2291s1c1,CCTCCCAAAGTGTTGGGATTA,pLKO.1,1548,3UTR,90,89,,,Y,10888,GPR83,CCGGCCTCCCAAAGTGTTGGGATTACTCGAGTAATCCCAACACTTTGGGAGGTTTTTG,AATTCAAAAACCTCCCAAAGTGTTGGGATTACTCGAGTAATCCCAACACTTTGGGAGG,n/a
human,219743,TYSND1,NR_073593.2,TRCN0000156315,NM_020702.1-3633s1c1,CCTCCCAAAGTGTTGGGATTA,pLKO.1,1548,3UTR,90,89,,,Y,57462,MYORG,CCGGCCTCCCAAAGTGTTGGGATTACTCGAGTAATCCCAACACTTTGGGAGGTTTTTG,AATTCAAAAACCTCCCAAAGTGTTGGGATTACTCGAGTAATCCCAACACTTTGGGAGG,n/a
human,219743,TYSND1,NR_073593.2,TRCN0000116227,NM_024930.1-2895s1c1,CCTCCCAAAGTTCTGGGATTA,pLKO.1,1548,3UTR,90,89,,,Y,79993,ELOVL7,CCGGCCTCCCAAAGTTCTGGGATTACTCGAGTAATCCCAGAACTTTGGGAGGTTTTTG,AATTCAAAAACCTCCCAAAGTTCTGGGATTACTCGAGTAATCCCAGAACTTTGGGAGG,n/a
human,219743,TYSND1,NR_073593.2,TRCN0000164591,NM_003281.3-2102s1c1,CCTCCCAAAGTTCTGGGATTA,pLKO.1,1548,3UTR,90,89,,,Y,7135,TNNI1,CCGGCCTCCCAAAGTTCTGGGATTACTCGAGTAATCCCAGAACTTTGGGAGGTTTTTG,AATTCAAAAACCTCCCAAAGTTCTGGGATTACTCGAGTAATCCCAGAACTTTGGGAGG,n/a
human,219743,TYSND1,NR_073593.2,TRCN0000040213,NM_000618.2-6169s1c1,CCTCCCAAATTGCTGGGATTA,pLKO.1,1548,3UTR,90,89,,,Y,3479,IGF1,CCGGCCTCCCAAATTGCTGGGATTACTCGAGTAATCCCAGCAATTTGGGAGGTTTTTG,AATTCAAAAACCTCCCAAATTGCTGGGATTACTCGAGTAATCCCAGCAATTTGGGAGG,n/a
human,219743,TYSND1,NR_073593.2,TRCN0000056566,NM_000697.1-859s1c1,GCTGACTTCATCCTTCTGGAT,pLKO.1,1505,3UTR,85,89,,,Y,239,ALOX12,CCGGGCTGACTTCATCCTTCTGGATCTCGAGATCCAGAAGGATGAAGTCAGCTTTTTG,AATTCAAAAAGCTGACTTCATCCTTCTGGATCTCGAGATCCAGAAGGATGAAGTCAGC,n/a
human,219743,TYSND1,NR_073593.2,TRCN0000162795,NM_017842.1-1079s1c1,CTTCCAAAGTGCTGGGATTAT,pLKO.1,1549,3UTR,85,89,,,Y,55652,SLC48A1,CCGGCTTCCAAAGTGCTGGGATTATCTCGAGATAATCCCAGCACTTTGGAAGTTTTTG,AATTCAAAAACTTCCAAAGTGCTGGGATTATCTCGAGATAATCCCAGCACTTTGGAAG,n/a
human,219743,TYSND1,NR_073593.2,TRCN0000140657,NM_012099.1-2957s1c1,CCTCCCAAAGTGCTAGGATAA,pLKO.1,1548,3UTR,85,89,,,Y,10849,CD3EAP,CCGGCCTCCCAAAGTGCTAGGATAACTCGAGTTATCCTAGCACTTTGGGAGGTTTTTG,AATTCAAAAACCTCCCAAAGTGCTAGGATAACTCGAGTTATCCTAGCACTTTGGGAGG,n/a
human,219743,TYSND1,NR_073593.2,TRCN0000172660,NM_024035.1-1257s1c1,GTCTCAAACTTCTGGGCTCAA,pLKO.1,1376,3UTR,85,89,,,Y,78998,RHPN1-AS1,CCGGGTCTCAAACTTCTGGGCTCAACTCGAGTTGAGCCCAGAAGTTTGAGACTTTTTG,AATTCAAAAAGTCTCAAACTTCTGGGCTCAACTCGAGTTGAGCCCAGAAGTTTGAGAC,n/a
human,219743,TYSND1,NR_073593.2,TRCN0000185426,XM_070233.3-102s1c1,GCAGATCAGCTTAAAGAATTA,pLKO.1,1743,3UTR,80,89,,,Y,137107,RPL10AP3,CCGGGCAGATCAGCTTAAAGAATTACTCGAGTAATTCTTTAAGCTGATCTGCTTTTTG,AATTCAAAAAGCAGATCAGCTTAAAGAATTACTCGAGTAATTCTTTAAGCTGATCTGC,n/a
human,219743,TYSND1,NR_073593.2,TRCN0000331036,NM_002225.3-1085s21c1,TCTAACACCTGTGAGCTAATC,pLKO_005,1974,3UTR,80,89,,,Y,3712,IVD,CCGGTCTAACACCTGTGAGCTAATCCTCGAGGATTAGCTCACAGGTGTTAGATTTTTG,AATTCAAAAATCTAACACCTGTGAGCTAATCCTCGAGGATTAGCTCACAGGTGTTAGA,n/a
human,219743,TYSND1,NR_073593.2,TRCN0000189685,NM_001029890.1-160s1c1,GCTGAGCACTTCTCCATGATA,pLKO.1,161,3UTR,80,89,,,Y,72640,Mex3a,CCGGGCTGAGCACTTCTCCATGATACTCGAGTATCATGGAGAAGTGCTCAGCTTTTTG,AATTCAAAAAGCTGAGCACTTCTCCATGATACTCGAGTATCATGGAGAAGTGCTCAGC,n/a
