Taxon,"Gene ID","Gene Symbol",Transcript,"Clone ID","Legacy Clone Name","Target Seq",Vector,"Match Position","Match Region","Match %","SDR Match %","Intrinsic Score","Adjusted Score","Matches Other Gene in Same Taxon?","Orig. Target Gene ID","Orig. Target Gene Symbol","Forward Oligo Sequence","Reverse Oligo Sequence",Addgene
human,219743,TYSND1,NR_073595.1,TRCN0000165948,NM_173555.1-2269s1c1,GCAGAAACCTTGCTCTGAAGA,pLKO.1,1252,3UTR,100,100,4.95,3.465,N,219743,TYSND1,CCGGGCAGAAACCTTGCTCTGAAGACTCGAGTCTTCAGAGCAAGGTTTCTGCTTTTTG,AATTCAAAAAGCAGAAACCTTGCTCTGAAGACTCGAGTCTTCAGAGCAAGGTTTCTGC,n/a
human,219743,TYSND1,NR_073595.1,TRCN0000165526,NM_173555.1-1798s1c1,GCTGTGTTACCACCTTTGGAA,pLKO.1,781,3UTR,100,100,3,2.1,N,219743,TYSND1,CCGGGCTGTGTTACCACCTTTGGAACTCGAGTTCCAAAGGTGGTAACACAGCTTTTTG,AATTCAAAAAGCTGTGTTACCACCTTTGGAACTCGAGTTCCAAAGGTGGTAACACAGC,n/a
human,219743,TYSND1,NR_073595.1,TRCN0000166268,NM_173555.1-1574s1c1,CCTTGGCATAATCACCAGCAA,pLKO.1,557,3UTR,100,100,2.64,1.848,N,219743,TYSND1,CCGGCCTTGGCATAATCACCAGCAACTCGAGTTGCTGGTGATTATGCCAAGGTTTTTG,AATTCAAAAACCTTGGCATAATCACCAGCAACTCGAGTTGCTGGTGATTATGCCAAGG,n/a
human,219743,TYSND1,NR_073595.1,TRCN0000166476,NM_173555.1-2291s1c1,CAGAGACAGAAGGGACAGAAA,pLKO.1,1274,3UTR,100,100,4.95,2.97,N,219743,TYSND1,CCGGCAGAGACAGAAGGGACAGAAACTCGAGTTTCTGTCCCTTCTGTCTCTGTTTTTG,AATTCAAAAACAGAGACAGAAGGGACAGAAACTCGAGTTTCTGTCCCTTCTGTCTCTG,n/a
human,219743,TYSND1,NR_073595.1,TRCN0000166267,NM_173555.1-1550s1c1,CTTCTCCAACCACTCAGGAAA,pLKO.1,533,3UTR,100,100,4.95,2.97,N,219743,TYSND1,CCGGCTTCTCCAACCACTCAGGAAACTCGAGTTTCCTGAGTGGTTGGAGAAGTTTTTG,AATTCAAAAACTTCTCCAACCACTCAGGAAACTCGAGTTTCCTGAGTGGTTGGAGAAG,n/a
human,219743,TYSND1,NR_073595.1,TRCN0000155836,NM_198582.1-3275s1c1,CCCAAAGTGCTGGGATTACAA,pLKO.1,1844,3UTR,95,100,5.625,2.8125,Y,377007,KLHL30,CCGGCCCAAAGTGCTGGGATTACAACTCGAGTTGTAATCCCAGCACTTTGGGTTTTTG,AATTCAAAAACCCAAAGTGCTGGGATTACAACTCGAGTTGTAATCCCAGCACTTTGGG,n/a
human,219743,TYSND1,NR_073595.1,TRCN0000141025,NM_152361.1-835s1c1,CCCAAAGTGCTGGGATTACTT,pLKO.1,1844,3UTR,90,100,5.625,2.8125,Y,126272,EID2B,CCGGCCCAAAGTGCTGGGATTACTTCTCGAGAAGTAATCCCAGCACTTTGGGTTTTTG,AATTCAAAAACCCAAAGTGCTGGGATTACTTCTCGAGAAGTAATCCCAGCACTTTGGG,n/a
human,219743,TYSND1,NR_073595.1,TRCN0000139826,NM_133477.1-4628s1c1,CCTCCTGAATAGCTGGGATTA,pLKO.1,1708,3UTR,95,95,,,Y,171024,SYNPO2,CCGGCCTCCTGAATAGCTGGGATTACTCGAGTAATCCCAGCTATTCAGGAGGTTTTTG,AATTCAAAAACCTCCTGAATAGCTGGGATTACTCGAGTAATCCCAGCTATTCAGGAGG,n/a
human,219743,TYSND1,NR_073595.1,TRCN0000140374,NM_025042.2-1098s1c1,GCTTCCCAAAGTACTGGGATT,pLKO.1,1840,3UTR,95,95,,,Y,,,CCGGGCTTCCCAAAGTACTGGGATTCTCGAGAATCCCAGTACTTTGGGAAGCTTTTTG,AATTCAAAAAGCTTCCCAAAGTACTGGGATTCTCGAGAATCCCAGTACTTTGGGAAGC,n/a
human,219743,TYSND1,NR_073595.1,TRCN0000139641,NM_014667.1-1306s1c1,CCTGCCTCAGTTACCAAAGAA,pLKO.1,1831,3UTR,81,90,,,Y,9686,VGLL4,CCGGCCTGCCTCAGTTACCAAAGAACTCGAGTTCTTTGGTAACTGAGGCAGGTTTTTG,AATTCAAAAACCTGCCTCAGTTACCAAAGAACTCGAGTTCTTTGGTAACTGAGGCAGG,n/a
human,219743,TYSND1,NR_073595.1,TRCN0000078633,NM_032214.2-1896s1c1,CCTCCAGAATAGCTGGGATTA,pLKO.1,1708,3UTR,90,89,,,Y,84174,SLA2,CCGGCCTCCAGAATAGCTGGGATTACTCGAGTAATCCCAGCTATTCTGGAGGTTTTTG,AATTCAAAAACCTCCAGAATAGCTGGGATTACTCGAGTAATCCCAGCTATTCTGGAGG,n/a
human,219743,TYSND1,NR_073595.1,TRCN0000129154,NM_017760.4-4749s1c1,GCTTCTCAAATTGCTGGGATT,pLKO.1,1840,3UTR,90,89,,,Y,54892,NCAPG2,CCGGGCTTCTCAAATTGCTGGGATTCTCGAGAATCCCAGCAATTTGAGAAGCTTTTTG,AATTCAAAAAGCTTCTCAAATTGCTGGGATTCTCGAGAATCCCAGCAATTTGAGAAGC,n/a
human,219743,TYSND1,NR_073595.1,TRCN0000156504,NM_201260.1-1037s1c1,CACAGTTCATTGCAGCCTCAA,pLKO.1,1655,3UTR,90,89,,,Y,131118,DNAJC19,CCGGCACAGTTCATTGCAGCCTCAACTCGAGTTGAGGCTGCAATGAACTGTGTTTTTG,AATTCAAAAACACAGTTCATTGCAGCCTCAACTCGAGTTGAGGCTGCAATGAACTGTG,n/a
human,219743,TYSND1,NR_073595.1,TRCN0000244541,NM_026119.3-766s21c1,GAAGATGATGTTGAGGTTATG,pLKO_005,828,3UTR,85,89,,,Y,67381,Med4,CCGGGAAGATGATGTTGAGGTTATGCTCGAGCATAACCTCAACATCATCTTCTTTTTG,AATTCAAAAAGAAGATGATGTTGAGGTTATGCTCGAGCATAACCTCAACATCATCTTC,n/a
human,219743,TYSND1,NR_073595.1,TRCN0000119026,NM_152468.3-2062s1c1,CTCTTCACCAACTACTCAGCA,pLKO.1,531,3UTR,85,89,,,Y,147138,TMC8,CCGGCTCTTCACCAACTACTCAGCACTCGAGTGCTGAGTAGTTGGTGAAGAGTTTTTG,AATTCAAAAACTCTTCACCAACTACTCAGCACTCGAGTGCTGAGTAGTTGGTGAAGAG,n/a
human,219743,TYSND1,NR_073595.1,TRCN0000056566,NM_000697.1-859s1c1,GCTGACTTCATCCTTCTGGAT,pLKO.1,1798,3UTR,85,89,,,Y,239,ALOX12,CCGGGCTGACTTCATCCTTCTGGATCTCGAGATCCAGAAGGATGAAGTCAGCTTTTTG,AATTCAAAAAGCTGACTTCATCCTTCTGGATCTCGAGATCCAGAAGGATGAAGTCAGC,n/a
human,219743,TYSND1,NR_073595.1,TRCN0000091821,NM_013769.1-1441s1c1,TGCAGGTGAATGGTATGCCAT,pLKO.1,460,3UTR,80,89,,,N,27375,Tjp3,CCGGTGCAGGTGAATGGTATGCCATCTCGAGATGGCATACCATTCACCTGCATTTTTG,AATTCAAAAATGCAGGTGAATGGTATGCCATCTCGAGATGGCATACCATTCACCTGCA,n/a
human,219743,TYSND1,NR_073595.1,TRCN0000185426,XM_070233.3-102s1c1,GCAGATCAGCTTAAAGAATTA,pLKO.1,2036,3UTR,80,89,,,Y,137107,RPL10AP3,CCGGGCAGATCAGCTTAAAGAATTACTCGAGTAATTCTTTAAGCTGATCTGCTTTTTG,AATTCAAAAAGCAGATCAGCTTAAAGAATTACTCGAGTAATTCTTTAAGCTGATCTGC,n/a
human,219743,TYSND1,NR_073595.1,TRCN0000331036,NM_002225.3-1085s21c1,TCTAACACCTGTGAGCTAATC,pLKO_005,2267,3UTR,80,89,,,Y,3712,IVD,CCGGTCTAACACCTGTGAGCTAATCCTCGAGGATTAGCTCACAGGTGTTAGATTTTTG,AATTCAAAAATCTAACACCTGTGAGCTAATCCTCGAGGATTAGCTCACAGGTGTTAGA,n/a
human,219743,TYSND1,NR_073595.1,TRCN0000189685,NM_001029890.1-160s1c1,GCTGAGCACTTCTCCATGATA,pLKO.1,357,3UTR,80,89,,,Y,72640,Mex3a,CCGGGCTGAGCACTTCTCCATGATACTCGAGTATCATGGAGAAGTGCTCAGCTTTTTG,AATTCAAAAAGCTGAGCACTTCTCCATGATACTCGAGTATCATGGAGAAGTGCTCAGC,n/a
