Taxon,"Gene ID","Gene Symbol",Transcript,"Clone ID","Legacy Clone Name","Target Seq",Vector,"Match Position","Match Region","Match %","SDR Match %","Intrinsic Score","Adjusted Score","Matches Other Gene in Same Taxon?","Orig. Target Gene ID","Orig. Target Gene Symbol","Forward Oligo Sequence","Reverse Oligo Sequence",Addgene
human,339400,FLG-AS1,NR_103779.1,TRCN0000166364,NM_181337.2-1227s1c1,CACACACACACACACACACAA,pLKO.1,1187,3UTR,95,100,4.95,2.475,Y,353219,KAAG1,CCGGCACACACACACACACACACAACTCGAGTTGTGTGTGTGTGTGTGTGTGTTTTTG,AATTCAAAAACACACACACACACACACACAACTCGAGTTGTGTGTGTGTGTGTGTGTG,n/a
human,339400,FLG-AS1,NR_103779.1,TRCN0000178741,NM_030137.1-574s1c1,CACACACATACACACACACAA,pLKO.1,1187,3UTR,90,95,,,Y,78617,Cstad,CCGGCACACACATACACACACACAACTCGAGTTGTGTGTGTGTATGTGTGTGTTTTTG,AATTCAAAAACACACACATACACACACACAACTCGAGTTGTGTGTGTGTATGTGTGTG,n/a
human,339400,FLG-AS1,NR_103779.1,TRCN0000073773,NM_022164.1-1914s1c1,CCTCTCAAGTAGCTGGGACTA,pLKO.1,128,3UTR,90,95,,,Y,64129,TINAGL1,CCGGCCTCTCAAGTAGCTGGGACTACTCGAGTAGTCCCAGCTACTTGAGAGGTTTTTG,AATTCAAAAACCTCTCAAGTAGCTGGGACTACTCGAGTAGTCCCAGCTACTTGAGAGG,n/a
human,339400,FLG-AS1,NR_103779.1,TRCN0000196646,NM_017886.1-432s1c1,GTGGATTACATCATCTTCATA,pLKO.1,2783,3UTR,90,89,,,Y,54986,ULK4,CCGGGTGGATTACATCATCTTCATACTCGAGTATGAAGATGATGTAATCCACTTTTTG,AATTCAAAAAGTGGATTACATCATCTTCATACTCGAGTATGAAGATGATGTAATCCAC,n/a
human,339400,FLG-AS1,NR_103779.1,TRCN0000168603,NM_153714.1-1494s1c1,GCCTTAAACTTCTGGACTCAA,pLKO.1,89,3UTR,90,89,,,Y,256815,C10orf67,CCGGGCCTTAAACTTCTGGACTCAACTCGAGTTGAGTCCAGAAGTTTAAGGCTTTTTG,AATTCAAAAAGCCTTAAACTTCTGGACTCAACTCGAGTTGAGTCCAGAAGTTTAAGGC,n/a
human,339400,FLG-AS1,NR_103779.1,TRCN0000264782,NM_026062.3-333s21c1,ATTTAGGAGTTTGGGATAATC,pLKO_005,1375,3UTR,85,89,,,Y,67266,Fam69a,CCGGATTTAGGAGTTTGGGATAATCCTCGAGGATTATCCCAAACTCCTAAATTTTTTG,AATTCAAAAAATTTAGGAGTTTGGGATAATCCTCGAGGATTATCCCAAACTCCTAAAT,n/a
human,339400,FLG-AS1,NR_103779.1,TRCN0000182869,NM_013534.3-1138s1c1,CTCGGAGAGAAGAGACAGTTA,pLKO.1,1915,3UTR,85,89,,,Y,14789,P3h3,CCGGCTCGGAGAGAAGAGACAGTTACTCGAGTAACTGTCTCTTCTCTCCGAGTTTTTG,AATTCAAAAACTCGGAGAGAAGAGACAGTTACTCGAGTAACTGTCTCTTCTCTCCGAG,n/a
human,339400,FLG-AS1,NR_103779.1,TRCN0000319994,NM_013534.4-1138s21c1,CTCGGAGAGAAGAGACAGTTA,pLKO_005,1915,3UTR,85,89,,,Y,14789,P3h3,CCGGCTCGGAGAGAAGAGACAGTTACTCGAGTAACTGTCTCTTCTCTCCGAGTTTTTG,AATTCAAAAACTCGGAGAGAAGAGACAGTTACTCGAGTAACTGTCTCTTCTCTCCGAG,n/a
human,339400,FLG-AS1,NR_103779.1,TRCN0000283927,NM_001008739.1-330s21c1,CCTGAGGTTCCAGGTCCTTTG,pLKO_005,2203,3UTR,85,89,,,Y,441150,C6orf226,CCGGCCTGAGGTTCCAGGTCCTTTGCTCGAGCAAAGGACCTGGAACCTCAGGTTTTTG,AATTCAAAAACCTGAGGTTCCAGGTCCTTTGCTCGAGCAAAGGACCTGGAACCTCAGG,n/a
human,339400,FLG-AS1,NR_103779.1,TRCN0000116737,NM_016369.3-2405s1c1,CCTCCCAAGTAGCTGGAATTA,pLKO.1,128,3UTR,85,89,,,Y,51208,CLDN18,CCGGCCTCCCAAGTAGCTGGAATTACTCGAGTAATTCCAGCTACTTGGGAGGTTTTTG,AATTCAAAAACCTCCCAAGTAGCTGGAATTACTCGAGTAATTCCAGCTACTTGGGAGG,n/a
human,339400,FLG-AS1,NR_103779.1,TRCN0000166194,NM_207490.1-1971s1c1,CACACACACACACTCAGTCTT,pLKO.1,1217,3UTR,85,89,,,Y,401123,LOC401123,CCGGCACACACACACACTCAGTCTTCTCGAGAAGACTGAGTGTGTGTGTGTGTTTTTG,AATTCAAAAACACACACACACACTCAGTCTTCTCGAGAAGACTGAGTGTGTGTGTGTG,n/a
human,339400,FLG-AS1,NR_103779.1,TRCN0000275741,NM_018393.2-2201s21c1,TTTGTTAGAAGGGCTATATAA,pLKO_005,2754,3UTR,80,89,,,Y,55346,TCP11L1,CCGGTTTGTTAGAAGGGCTATATAACTCGAGTTATATAGCCCTTCTAACAAATTTTTG,AATTCAAAAATTTGTTAGAAGGGCTATATAACTCGAGTTATATAGCCCTTCTAACAAA,n/a
human,339400,FLG-AS1,NR_103779.1,TRCN0000358114,NM_001057.2-849s21c1,TCAATGCCGCCTTCAACTTTG,pLKO_005,81,3UTR,80,89,,,Y,6865,TACR2,CCGGTCAATGCCGCCTTCAACTTTGCTCGAGCAAAGTTGAAGGCGGCATTGATTTTTG,AATTCAAAAATCAATGCCGCCTTCAACTTTGCTCGAGCAAAGTTGAAGGCGGCATTGA,n/a
human,339400,FLG-AS1,NR_103779.1,TRCN0000061988,NM_002078.3-2300s1c1,GCCCACATAGAAGAAATGAAT,pLKO.1,2412,3UTR,80,89,,,Y,2803,GOLGA4,CCGGGCCCACATAGAAGAAATGAATCTCGAGATTCATTTCTTCTATGTGGGCTTTTTG,AATTCAAAAAGCCCACATAGAAGAAATGAATCTCGAGATTCATTTCTTCTATGTGGGC,n/a
human,339400,FLG-AS1,NR_103779.1,TRCN0000286363,NM_002078.3-2300s21c1,GCCCACATAGAAGAAATGAAT,pLKO_005,2412,3UTR,80,89,,,Y,2803,GOLGA4,CCGGGCCCACATAGAAGAAATGAATCTCGAGATTCATTTCTTCTATGTGGGCTTTTTG,AATTCAAAAAGCCCACATAGAAGAAATGAATCTCGAGATTCATTTCTTCTATGTGGGC,n/a
human,339400,FLG-AS1,NR_103779.1,TRCN0000079580,NM_027216.2-1100s1c1,CGTGGTCATGGATGACATCAT,pLKO.1,2252,3UTR,80,89,,,Y,69806,Slc39a11,CCGGCGTGGTCATGGATGACATCATCTCGAGATGATGTCATCCATGACCACGTTTTTG,AATTCAAAAACGTGGTCATGGATGACATCATCTCGAGATGATGTCATCCATGACCACG,n/a
human,339400,FLG-AS1,NR_103779.1,TRCN0000176607,NM_146026.1-533s1c1,CTTTGATGACAGAGAGAACAA,pLKO.1,523,3UTR,80,89,,,Y,217138,Prr15l,CCGGCTTTGATGACAGAGAGAACAACTCGAGTTGTTCTCTCTGTCATCAAAGTTTTTG,AATTCAAAAACTTTGATGACAGAGAGAACAACTCGAGTTGTTCTCTCTGTCATCAAAG,n/a
human,339400,FLG-AS1,NR_103779.1,TRCN0000007000,NM_144685.3-1124s1c1,GCCGCAAGTATATGCTCAAGT,pLKO.1,757,3UTR,80,89,,,Y,147746,HIPK4,CCGGGCCGCAAGTATATGCTCAAGTCTCGAGACTTGAGCATATACTTGCGGCTTTTTG,AATTCAAAAAGCCGCAAGTATATGCTCAAGTCTCGAGACTTGAGCATATACTTGCGGC,n/a
human,339400,FLG-AS1,NR_103779.1,TRCN0000187538,NM_026104.1-919s1c1,GAAGCTGAGATGTTTCCTCTT,pLKO.1,485,3UTR,80,89,,,Y,67356,Tmco5,CCGGGAAGCTGAGATGTTTCCTCTTCTCGAGAAGAGGAAACATCTCAGCTTCTTTTTG,AATTCAAAAAGAAGCTGAGATGTTTCCTCTTCTCGAGAAGAGGAAACATCTCAGCTTC,n/a
human,339400,FLG-AS1,NR_103779.1,TRCN0000137703,NM_015464.1-537s1c1,GAACAAAGTACTGGAGCAGGA,pLKO.1,314,3UTR,80,89,,,Y,25928,SOSTDC1,CCGGGAACAAAGTACTGGAGCAGGACTCGAGTCCTGCTCCAGTACTTTGTTCTTTTTG,AATTCAAAAAGAACAAAGTACTGGAGCAGGACTCGAGTCCTGCTCCAGTACTTTGTTC,n/a
human,339400,FLG-AS1,NR_103779.1,TRCN0000232058,NM_172373.2-1608s21c1,TACTGGATCTCAGAAGTTTAT,pLKO_005,459,3UTR,80,89,,,Y,1997,ELF1,CCGGTACTGGATCTCAGAAGTTTATCTCGAGATAAACTTCTGAGATCCAGTATTTTTG,AATTCAAAAATACTGGATCTCAGAAGTTTATCTCGAGATAAACTTCTGAGATCCAGTA,n/a
human,339400,FLG-AS1,NR_103779.1,TRCN0000264628,NM_175687.2-484s21c1,CATGAAGCAAGACCAAGATAT,pLKO_005,1111,3UTR,80,89,,,Y,319278,A230050P20Rik,CCGGCATGAAGCAAGACCAAGATATCTCGAGATATCTTGGTCTTGCTTCATGTTTTTG,AATTCAAAAACATGAAGCAAGACCAAGATATCTCGAGATATCTTGGTCTTGCTTCATG,n/a
human,339400,FLG-AS1,NR_103779.1,TRCN0000193581,NM_134127.1-1934s1c1,GTCTTACTCTATTGCCCAATA,pLKO.1,35,3UTR,80,89,,,Y,106648,Cyp4f15,CCGGGTCTTACTCTATTGCCCAATACTCGAGTATTGGGCAATAGAGTAAGACTTTTTG,AATTCAAAAAGTCTTACTCTATTGCCCAATACTCGAGTATTGGGCAATAGAGTAAGAC,n/a
human,339400,FLG-AS1,NR_103779.1,TRCN0000174282,NM_146034.1-2508s1c1,CAGTTTAAGTAACTGCTGTTA,pLKO.1,1888,3UTR,80,89,,,Y,,,CCGGCAGTTTAAGTAACTGCTGTTACTCGAGTAACAGCAGTTACTTAAACTGTTTTTG,AATTCAAAAACAGTTTAAGTAACTGCTGTTACTCGAGTAACAGCAGTTACTTAAACTG,n/a
human,339400,FLG-AS1,NR_103779.1,TRCN0000021964,NM_003483.3-3037s1c1,CCAACCTTCAAAGAACTTGAA,pLKO.1,179,3UTR,86,85,,,Y,8091,HMGA2,CCGGCCAACCTTCAAAGAACTTGAACTCGAGTTCAAGTTCTTTGAAGGTTGGTTTTTG,AATTCAAAAACCAACCTTCAAAGAACTTGAACTCGAGTTCAAGTTCTTTGAAGGTTGG,n/a
human,339400,FLG-AS1,NR_103779.1,TRCN0000060712,NM_001495.3-1490s1c1,CAAAGAGTTAAGCATGTGCTT,pLKO.1,2656,3UTR,81,85,,,Y,2675,GFRA2,CCGGCAAAGAGTTAAGCATGTGCTTCTCGAGAAGCACATGCTTAACTCTTTGTTTTTG,AATTCAAAAACAAAGAGTTAAGCATGTGCTTCTCGAGAAGCACATGCTTAACTCTTTG,n/a
human,339400,FLG-AS1,NR_103779.1,TRCN0000013730,NM_000554.2-928s1c1,CGTGGATAGCTTGGAATTCAA,pLKO.1,603,3UTR,81,85,,,Y,1406,CRX,CCGGCGTGGATAGCTTGGAATTCAACTCGAGTTGAATTCCAAGCTATCCACGTTTTTG,AATTCAAAAACGTGGATAGCTTGGAATTCAACTCGAGTTGAATTCCAAGCTATCCACG,n/a
human,339400,FLG-AS1,NR_103779.1,TRCN0000091294,NM_009932.2-4984s1c1,CGGATATTCATTCCTCATGTA,pLKO.1,1570,3UTR,81,85,,,Y,12827,Col4a2,CCGGCGGATATTCATTCCTCATGTACTCGAGTACATGAGGAATGAATATCCGTTTTTG,AATTCAAAAACGGATATTCATTCCTCATGTACTCGAGTACATGAGGAATGAATATCCG,n/a
human,339400,FLG-AS1,NR_103779.1,TRCN0000374551,NM_134034.1-1882s21c1,ACATCACACATACCACATAAA,pLKO_005,1183,3UTR,81,85,,,Y,104570,Ppp4r3b,CCGGACATCACACATACCACATAAACTCGAGTTTATGTGGTATGTGTGATGTTTTTTG,AATTCAAAAAACATCACACATACCACATAAACTCGAGTTTATGTGGTATGTGTGATGT,n/a
human,339400,FLG-AS1,NR_103779.1,TRCN0000204600,NM_146361.1-34s1c1,CCAAATGGAAGTTTGGCCCAT,pLKO.1,1123,3UTR,77,85,,,Y,258358,Olfr557,CCGGCCAAATGGAAGTTTGGCCCATCTCGAGATGGGCCAAACTTCCATTTGGTTTTTG,AATTCAAAAACCAAATGGAAGTTTGGCCCATCTCGAGATGGGCCAAACTTCCATTTGG,n/a
