Taxon,"Gene ID","Gene Symbol",Transcript,"Clone ID","Legacy Clone Name","Target Seq",Vector,"Match Position","Match Region","Match %","SDR Match %","Intrinsic Score","Adjusted Score","Matches Other Gene in Same Taxon?","Orig. Target Gene ID","Orig. Target Gene Symbol","Forward Oligo Sequence","Reverse Oligo Sequence",Addgene
human,64109,CRLF2,NR_110830.2,TRCN0000059179,NM_022148.2-286s1c1,GCGAGACGACATTCTCTATTT,pLKO.1,282,3UTR,100,100,13.2,18.48,N,64109,CRLF2,CCGGGCGAGACGACATTCTCTATTTCTCGAGAAATAGAGAATGTCGTCTCGCTTTTTG,AATTCAAAAAGCGAGACGACATTCTCTATTTCTCGAGAAATAGAGAATGTCGTCTCGC,n/a
human,64109,CRLF2,NR_110830.2,TRCN0000434746,NM_022148.2-342s21c1,CAAGTCGCTGGATGGTTTATT,pLKO_005,338,3UTR,100,100,15,10.5,N,64109,CRLF2,CCGGCAAGTCGCTGGATGGTTTATTCTCGAGAATAAACCATCCAGCGACTTGTTTTTG,AATTCAAAAACAAGTCGCTGGATGGTTTATTCTCGAGAATAAACCATCCAGCGACTTG,n/a
human,64109,CRLF2,NR_110830.2,TRCN0000420840,NM_022148.2-1359s21c1,CAATTGCTCCAGGAGATTTAC,pLKO_005,1537,3UTR,100,100,13.2,9.24,N,64109,CRLF2,CCGGCAATTGCTCCAGGAGATTTACCTCGAGGTAAATCTCCTGGAGCAATTGTTTTTG,AATTCAAAAACAATTGCTCCAGGAGATTTACCTCGAGGTAAATCTCCTGGAGCAATTG,n/a
human,64109,CRLF2,NR_110830.2,TRCN0000059180,NM_022148.2-757s1c1,CCTTCTGTCTTTATGGAAATT,pLKO.1,935,3UTR,100,100,13.2,9.24,N,64109,CRLF2,CCGGCCTTCTGTCTTTATGGAAATTCTCGAGAATTTCCATAAAGACAGAAGGTTTTTG,AATTCAAAAACCTTCTGTCTTTATGGAAATTCTCGAGAATTTCCATAAAGACAGAAGG,n/a
human,64109,CRLF2,NR_110830.2,TRCN0000425368,NM_022148.2-1159s21c1,TCAGGATCCACGTTGACATTT,pLKO_005,1337,3UTR,100,100,13.2,9.24,N,64109,CRLF2,CCGGTCAGGATCCACGTTGACATTTCTCGAGAAATGTCAACGTGGATCCTGATTTTTG,AATTCAAAAATCAGGATCCACGTTGACATTTCTCGAGAAATGTCAACGTGGATCCTGA,n/a
human,64109,CRLF2,NR_110830.2,TRCN0000059178,NM_022148.2-689s1c1,CCCAAACCAAAGCTGTCCAAA,pLKO.1,867,3UTR,100,100,4.95,3.465,N,64109,CRLF2,CCGGCCCAAACCAAAGCTGTCCAAACTCGAGTTTGGACAGCTTTGGTTTGGGTTTTTG,AATTCAAAAACCCAAACCAAAGCTGTCCAAACTCGAGTTTGGACAGCTTTGGTTTGGG,n/a
human,64109,CRLF2,NR_110830.2,TRCN0000059181,NM_022148.2-181s1c1,CCTGACTTTCCACTACAGATT,pLKO.1,177,3UTR,100,100,4.95,3.465,N,64109,CRLF2,CCGGCCTGACTTTCCACTACAGATTCTCGAGAATCTGTAGTGGAAAGTCAGGTTTTTG,AATTCAAAAACCTGACTTTCCACTACAGATTCTCGAGAATCTGTAGTGGAAAGTCAGG,n/a
human,64109,CRLF2,NR_110830.2,TRCN0000150833,NM_207309.1-2994s1c1,GCCTGGCTAATTCTTTGTATT,pLKO.1,632,3UTR,95,95,,,Y,91373,UAP1L1,CCGGGCCTGGCTAATTCTTTGTATTCTCGAGAATACAAAGAATTAGCCAGGCTTTTTG,AATTCAAAAAGCCTGGCTAATTCTTTGTATTCTCGAGAATACAAAGAATTAGCCAGGC,n/a
human,64109,CRLF2,NR_110830.2,TRCN0000430981,NM_173537.2-3266s21c1,GCCACCATGCCTGGCTAATTT,pLKO_005,624,3UTR,95,95,,,Y,84163,GTF2IRD2,CCGGGCCACCATGCCTGGCTAATTTCTCGAGAAATTAGCCAGGCATGGTGGCTTTTTG,AATTCAAAAAGCCACCATGCCTGGCTAATTTCTCGAGAAATTAGCCAGGCATGGTGGC,n/a
human,64109,CRLF2,NR_110830.2,TRCN0000116737,NM_016369.3-2405s1c1,CCTCCCAAGTAGCTGGAATTA,pLKO.1,594,3UTR,95,95,,,Y,51208,CLDN18,CCGGCCTCCCAAGTAGCTGGAATTACTCGAGTAATTCCAGCTACTTGGGAGGTTTTTG,AATTCAAAAACCTCCCAAGTAGCTGGAATTACTCGAGTAATTCCAGCTACTTGGGAGG,n/a
human,64109,CRLF2,NR_110830.2,TRCN0000165774,NM_001012391.1-946s1c1,CCTCCTAAGTAGCTGGGATTA,pLKO.1,594,3UTR,95,95,,,Y,100652781,SNX29P1,CCGGCCTCCTAAGTAGCTGGGATTACTCGAGTAATCCCAGCTACTTAGGAGGTTTTTG,AATTCAAAAACCTCCTAAGTAGCTGGGATTACTCGAGTAATCCCAGCTACTTAGGAGG,n/a
human,64109,CRLF2,NR_110830.2,TRCN0000060503,NM_001001414.1-1521s1c1,CCTCTCAAGTAGCTGGGATTA,pLKO.1,594,3UTR,95,95,,,Y,342897,NCCRP1,CCGGCCTCTCAAGTAGCTGGGATTACTCGAGTAATCCCAGCTACTTGAGAGGTTTTTG,AATTCAAAAACCTCTCAAGTAGCTGGGATTACTCGAGTAATCCCAGCTACTTGAGAGG,n/a
human,64109,CRLF2,NR_110830.2,TRCN0000155576,NM_198582.1-3137s1c1,CCTCTCAAGTAGCTGGGATTA,pLKO.1,594,3UTR,95,95,,,Y,377007,KLHL30,CCGGCCTCTCAAGTAGCTGGGATTACTCGAGTAATCCCAGCTACTTGAGAGGTTTTTG,AATTCAAAAACCTCTCAAGTAGCTGGGATTACTCGAGTAATCCCAGCTACTTGAGAGG,n/a
human,64109,CRLF2,NR_110830.2,TRCN0000165697,NM_017842.1-943s1c1,CCTCTCAAGTAGCTGGGATTA,pLKO.1,594,3UTR,95,95,,,Y,55652,SLC48A1,CCGGCCTCTCAAGTAGCTGGGATTACTCGAGTAATCCCAGCTACTTGAGAGGTTTTTG,AATTCAAAAACCTCTCAAGTAGCTGGGATTACTCGAGTAATCCCAGCTACTTGAGAGG,n/a
human,64109,CRLF2,NR_110830.2,TRCN0000138395,XM_374933.1-1847s1c1,CCTTCCAAGTAGCTGGGATTA,pLKO.1,594,3UTR,95,95,,,Y,399949,C11orf88,CCGGCCTTCCAAGTAGCTGGGATTACTCGAGTAATCCCAGCTACTTGGAAGGTTTTTG,AATTCAAAAACCTTCCAAGTAGCTGGGATTACTCGAGTAATCCCAGCTACTTGGAAGG,n/a
human,64109,CRLF2,NR_110830.2,TRCN0000057398,NM_002261.1-793s1c1,CCTCCCAAGTTGCTGGGATTA,pLKO.1,594,3UTR,95,95,,,Y,3823,KLRC3,CCGGCCTCCCAAGTTGCTGGGATTACTCGAGTAATCCCAGCAACTTGGGAGGTTTTTG,AATTCAAAAACCTCCCAAGTTGCTGGGATTACTCGAGTAATCCCAGCAACTTGGGAGG,n/a
human,64109,CRLF2,NR_110830.2,TRCN0000044353,NM_014591.3-763s1c1,GCAGATTTACTCCCAGTTCTT,pLKO.1,1548,3UTR,90,95,,,Y,30819,KCNIP2,CCGGGCAGATTTACTCCCAGTTCTTCTCGAGAAGAACTGGGAGTAAATCTGCTTTTTG,AATTCAAAAAGCAGATTTACTCCCAGTTCTTCTCGAGAAGAACTGGGAGTAAATCTGC,n/a
human,64109,CRLF2,NR_110830.2,TRCN0000091448,NM_013513.1-2495s1c1,CCTCCCAAGTACTGGGATTAA,pLKO.1,594,3UTR,90,95,,,Y,13828,Epb42,CCGGCCTCCCAAGTACTGGGATTAACTCGAGTTAATCCCAGTACTTGGGAGGTTTTTG,AATTCAAAAACCTCCCAAGTACTGGGATTAACTCGAGTTAATCCCAGTACTTGGGAGG,n/a
human,64109,CRLF2,NR_110830.2,TRCN0000134716,NM_022901.1-2328s1c1,GCCTGGCTAATTTCTGTATTT,pLKO.1,632,3UTR,90,95,,,Y,64922,LRRC19,CCGGGCCTGGCTAATTTCTGTATTTCTCGAGAAATACAGAAATTAGCCAGGCTTTTTG,AATTCAAAAAGCCTGGCTAATTTCTGTATTTCTCGAGAAATACAGAAATTAGCCAGGC,n/a
human,64109,CRLF2,NR_110830.2,TRCN0000264189,NM_001085490.1-613s21c1,CAAGTAGCTGGGACTACAGGA,pLKO_005,599,3UTR,90,95,,,Y,285501,LINC01098,CCGGCAAGTAGCTGGGACTACAGGACTCGAGTCCTGTAGTCCCAGCTACTTGTTTTTG,AATTCAAAAACAAGTAGCTGGGACTACAGGACTCGAGTCCTGTAGTCCCAGCTACTTG,n/a
human,64109,CRLF2,NR_110830.2,TRCN0000141125,NM_153233.1-1432s1c1,CAGGTTCAAGAGATTCTCCTA,pLKO.1,567,3UTR,90,95,,,Y,163183,SYNE4,CCGGCAGGTTCAAGAGATTCTCCTACTCGAGTAGGAGAATCTCTTGAACCTGTTTTTG,AATTCAAAAACAGGTTCAAGAGATTCTCCTACTCGAGTAGGAGAATCTCTTGAACCTG,n/a
human,64109,CRLF2,NR_110830.2,TRCN0000130146,NM_207443.1-652s1c1,CAGGTTCAAGTGATTCTCCTA,pLKO.1,567,3UTR,90,95,,,Y,400242,DICER1-AS1,CCGGCAGGTTCAAGTGATTCTCCTACTCGAGTAGGAGAATCACTTGAACCTGTTTTTG,AATTCAAAAACAGGTTCAAGTGATTCTCCTACTCGAGTAGGAGAATCACTTGAACCTG,n/a
human,64109,CRLF2,NR_110830.2,TRCN0000157486,NM_014284.1-566s1c1,GCAGGTGACATAGATGCCAAA,pLKO.1,138,3UTR,81,90,,,Y,23154,NCDN,CCGGGCAGGTGACATAGATGCCAAACTCGAGTTTGGCATCTATGTCACCTGCTTTTTG,AATTCAAAAAGCAGGTGACATAGATGCCAAACTCGAGTTTGGCATCTATGTCACCTGC,n/a
human,64109,CRLF2,NR_110830.2,TRCN0000052522,NM_006755.1-911s1c1,CCACCTGGATGAGAAGTCTTT,pLKO.1,1391,3UTR,81,90,,,Y,6888,TALDO1,CCGGCCACCTGGATGAGAAGTCTTTCTCGAGAAAGACTTCTCATCCAGGTGGTTTTTG,AATTCAAAAACCACCTGGATGAGAAGTCTTTCTCGAGAAAGACTTCTCATCCAGGTGG,n/a
human,64109,CRLF2,NR_110830.2,TRCN0000299131,NM_006755.1-911s21c1,CCACCTGGATGAGAAGTCTTT,pLKO_005,1391,3UTR,81,90,,,Y,6888,TALDO1,CCGGCCACCTGGATGAGAAGTCTTTCTCGAGAAAGACTTCTCATCCAGGTGGTTTTTG,AATTCAAAAACCACCTGGATGAGAAGTCTTTCTCGAGAAAGACTTCTCATCCAGGTGG,n/a
human,64109,CRLF2,NR_110830.2,TRCN0000156872,NM_058219.2-1204s1c1,GCAACCACACCTGGCTAATTT,pLKO.1,624,3UTR,90,89,,,Y,118460,EXOSC6,CCGGGCAACCACACCTGGCTAATTTCTCGAGAAATTAGCCAGGTGTGGTTGCTTTTTG,AATTCAAAAAGCAACCACACCTGGCTAATTTCTCGAGAAATTAGCCAGGTGTGGTTGC,n/a
human,64109,CRLF2,NR_110830.2,TRCN0000139587,NM_052966.1-4502s1c1,CGTCCCAAGTAGCTGGAATTA,pLKO.1,594,3UTR,90,89,,,Y,116496,NIBAN1,CCGGCGTCCCAAGTAGCTGGAATTACTCGAGTAATTCCAGCTACTTGGGACGTTTTTG,AATTCAAAAACGTCCCAAGTAGCTGGAATTACTCGAGTAATTCCAGCTACTTGGGACG,n/a
human,64109,CRLF2,NR_110830.2,TRCN0000140610,NM_025042.2-931s1c1,GCCTCTCAGGTTCAAGCAATT,pLKO.1,561,3UTR,90,89,,,Y,,,CCGGGCCTCTCAGGTTCAAGCAATTCTCGAGAATTGCTTGAACCTGAGAGGCTTTTTG,AATTCAAAAAGCCTCTCAGGTTCAAGCAATTCTCGAGAATTGCTTGAACCTGAGAGGC,n/a
human,64109,CRLF2,NR_110830.2,TRCN0000121422,NM_172859.1-2893s1c1,CCTCCGAAGTAGCTGAGATTA,pLKO.1,594,3UTR,90,89,,,Y,241688,Dzank1,CCGGCCTCCGAAGTAGCTGAGATTACTCGAGTAATCTCAGCTACTTCGGAGGTTTTTG,AATTCAAAAACCTCCGAAGTAGCTGAGATTACTCGAGTAATCTCAGCTACTTCGGAGG,n/a
human,64109,CRLF2,NR_110830.2,TRCN0000165534,NM_001012717.1-362s1c1,GAGACAGGGTTTCACCATGTT,pLKO.1,659,3UTR,90,89,,,Y,,,CCGGGAGACAGGGTTTCACCATGTTCTCGAGAACATGGTGAAACCCTGTCTCTTTTTG,AATTCAAAAAGAGACAGGGTTTCACCATGTTCTCGAGAACATGGTGAAACCCTGTCTC,n/a
human,64109,CRLF2,NR_110830.2,TRCN0000073773,NM_022164.1-1914s1c1,CCTCTCAAGTAGCTGGGACTA,pLKO.1,594,3UTR,90,89,,,Y,64129,TINAGL1,CCGGCCTCTCAAGTAGCTGGGACTACTCGAGTAGTCCCAGCTACTTGAGAGGTTTTTG,AATTCAAAAACCTCTCAAGTAGCTGGGACTACTCGAGTAGTCCCAGCTACTTGAGAGG,n/a
human,64109,CRLF2,NR_110830.2,TRCN0000008902,NM_016540.2-2291s1c1,CCTCCCAAAGTGTTGGGATTA,pLKO.1,729,3UTR,90,89,,,Y,10888,GPR83,CCGGCCTCCCAAAGTGTTGGGATTACTCGAGTAATCCCAACACTTTGGGAGGTTTTTG,AATTCAAAAACCTCCCAAAGTGTTGGGATTACTCGAGTAATCCCAACACTTTGGGAGG,n/a
human,64109,CRLF2,NR_110830.2,TRCN0000156315,NM_020702.1-3633s1c1,CCTCCCAAAGTGTTGGGATTA,pLKO.1,729,3UTR,90,89,,,Y,57462,MYORG,CCGGCCTCCCAAAGTGTTGGGATTACTCGAGTAATCCCAACACTTTGGGAGGTTTTTG,AATTCAAAAACCTCCCAAAGTGTTGGGATTACTCGAGTAATCCCAACACTTTGGGAGG,n/a
human,64109,CRLF2,NR_110830.2,TRCN0000040213,NM_000618.2-6169s1c1,CCTCCCAAATTGCTGGGATTA,pLKO.1,594,3UTR,90,89,,,Y,3479,IGF1,CCGGCCTCCCAAATTGCTGGGATTACTCGAGTAATCCCAGCAATTTGGGAGGTTTTTG,AATTCAAAAACCTCCCAAATTGCTGGGATTACTCGAGTAATCCCAGCAATTTGGGAGG,n/a
human,64109,CRLF2,NR_110830.2,TRCN0000127583,NM_174931.1-552s1c1,CAAATTGTCCAGGACCAACTT,pLKO.1,159,3UTR,85,89,,,Y,253635,GPATCH11,CCGGCAAATTGTCCAGGACCAACTTCTCGAGAAGTTGGTCCTGGACAATTTGTTTTTG,AATTCAAAAACAAATTGTCCAGGACCAACTTCTCGAGAAGTTGGTCCTGGACAATTTG,n/a
human,64109,CRLF2,NR_110830.2,TRCN0000072510,NM_000598.4-711s1c1,GAGCACAGATACCCAGAACTT,pLKO.1,1052,3UTR,85,89,,,Y,3486,IGFBP3,CCGGGAGCACAGATACCCAGAACTTCTCGAGAAGTTCTGGGTATCTGTGCTCTTTTTG,AATTCAAAAAGAGCACAGATACCCAGAACTTCTCGAGAAGTTCTGGGTATCTGTGCTC,n/a
human,64109,CRLF2,NR_110830.2,TRCN0000075107,NM_030877.3-890s1c1,GCCATATTGCTCCAGGACAAT,pLKO.1,1535,3UTR,85,89,,,Y,56259,CTNNBL1,CCGGGCCATATTGCTCCAGGACAATCTCGAGATTGTCCTGGAGCAATATGGCTTTTTG,AATTCAAAAAGCCATATTGCTCCAGGACAATCTCGAGATTGTCCTGGAGCAATATGGC,n/a
human,64109,CRLF2,NR_110830.2,TRCN0000290261,NM_030877.3-890s21c1,GCCATATTGCTCCAGGACAAT,pLKO_005,1535,3UTR,85,89,,,Y,56259,CTNNBL1,CCGGGCCATATTGCTCCAGGACAATCTCGAGATTGTCCTGGAGCAATATGGCTTTTTG,AATTCAAAAAGCCATATTGCTCCAGGACAATCTCGAGATTGTCCTGGAGCAATATGGC,n/a
human,64109,CRLF2,NR_110830.2,TRCN0000181359,NM_176916.2-607s1c1,CAGATTCAAAGGTGCTGAGGT,pLKO.1,192,3UTR,85,89,,,Y,319455,Pld5,CCGGCAGATTCAAAGGTGCTGAGGTCTCGAGACCTCAGCACCTTTGAATCTGTTTTTG,AATTCAAAAACAGATTCAAAGGTGCTGAGGTCTCGAGACCTCAGCACCTTTGAATCTG,n/a
human,64109,CRLF2,NR_110830.2,TRCN0000337418,NM_001114403.1-1038s21c1,CCTCACGGGTTCAAGCGATTT,pLKO_005,562,3UTR,85,89,,,Y,100134938,UPK3BL1,CCGGCCTCACGGGTTCAAGCGATTTCTCGAGAAATCGCTTGAACCCGTGAGGTTTTTG,AATTCAAAAACCTCACGGGTTCAAGCGATTTCTCGAGAAATCGCTTGAACCCGTGAGG,n/a
human,64109,CRLF2,NR_110830.2,TRCN0000026970,XM_354585.1-312s1c1,GACAGATGACTATGCAGAGAT,pLKO.1,836,3UTR,85,89,,,Y,380676,Gm1872,CCGGGACAGATGACTATGCAGAGATCTCGAGATCTCTGCATAGTCATCTGTCTTTTTG,AATTCAAAAAGACAGATGACTATGCAGAGATCTCGAGATCTCTGCATAGTCATCTGTC,n/a
human,64109,CRLF2,NR_110830.2,TRCN0000129739,NM_152410.1-932s1c1,CTCTCAAGTAGCTGAGATTAT,pLKO.1,595,3UTR,85,89,,,Y,135138,PACRG,CCGGCTCTCAAGTAGCTGAGATTATCTCGAGATAATCTCAGCTACTTGAGAGTTTTTG,AATTCAAAAACTCTCAAGTAGCTGAGATTATCTCGAGATAATCTCAGCTACTTGAGAG,n/a
human,64109,CRLF2,NR_110830.2,TRCN0000375078,NM_018870.3-476s21c1,CACCACCCATGGATGAGAAAC,pLKO_005,1389,3UTR,80,89,,,Y,56012,Pgam2,CCGGCACCACCCATGGATGAGAAACCTCGAGGTTTCTCATCCATGGGTGGTGTTTTTG,AATTCAAAAACACCACCCATGGATGAGAAACCTCGAGGTTTCTCATCCATGGGTGGTG,n/a
human,64109,CRLF2,NR_110830.2,TRCN0000282344,NM_001098409.1-256s21c1,CAACTCAACGTCAGGATCCTG,pLKO_005,1327,3UTR,80,89,,,Y,645073,GAGE12G,CCGGCAACTCAACGTCAGGATCCTGCTCGAGCAGGATCCTGACGTTGAGTTGTTTTTG,AATTCAAAAACAACTCAACGTCAGGATCCTGCTCGAGCAGGATCCTGACGTTGAGTTG,n/a
human,64109,CRLF2,NR_110830.2,TRCN0000360576,NM_133919.3-2408s21c1,GCCTTTGAGAGACACCAAATT,pLKO_005,843,3UTR,77,85,,,Y,17355,Aff1,CCGGGCCTTTGAGAGACACCAAATTCTCGAGAATTTGGTGTCTCTCAAAGGCTTTTTG,AATTCAAAAAGCCTTTGAGAGACACCAAATTCTCGAGAATTTGGTGTCTCTCAAAGGC,n/a
human,64109,CRLF2,NR_110830.2,TRCN0000200011,NM_052843.1-3103s1c1,CGGAGGTGATGTGGTACAAAG,pLKO.1,1241,3UTR,77,85,,,Y,84033,OBSCN,CCGGCGGAGGTGATGTGGTACAAAGCTCGAGCTTTGTACCACATCACCTCCGTTTTTG,AATTCAAAAACGGAGGTGATGTGGTACAAAGCTCGAGCTTTGTACCACATCACCTCCG,n/a
