Taxon,"Gene ID","Gene Symbol",Transcript,"Clone ID","Legacy Clone Name","Target Seq",Vector,"Match Position","Match Region","Match %","SDR Match %","Intrinsic Score","Adjusted Score","Matches Other Gene in Same Taxon?","Orig. Target Gene ID","Orig. Target Gene Symbol","Forward Oligo Sequence","Reverse Oligo Sequence",Addgene
human,101927131,LOC101927131,NR_110907.1,TRCN0000130146,NM_207443.1-652s1c1,CAGGTTCAAGTGATTCTCCTA,pLKO.1,1390,3UTR,95,100,2.64,1.32,Y,400242,DICER1-AS1,CCGGCAGGTTCAAGTGATTCTCCTACTCGAGTAGGAGAATCACTTGAACCTGTTTTTG,AATTCAAAAACAGGTTCAAGTGATTCTCCTACTCGAGTAGGAGAATCACTTGAACCTG,n/a
human,101927131,LOC101927131,NR_110907.1,TRCN0000150833,NM_207309.1-2994s1c1,GCCTGGCTAATTCTTTGTATT,pLKO.1,1455,3UTR,95,95,,,Y,91373,UAP1L1,CCGGGCCTGGCTAATTCTTTGTATTCTCGAGAATACAAAGAATTAGCCAGGCTTTTTG,AATTCAAAAAGCCTGGCTAATTCTTTGTATTCTCGAGAATACAAAGAATTAGCCAGGC,n/a
human,101927131,LOC101927131,NR_110907.1,TRCN0000134716,NM_022901.1-2328s1c1,GCCTGGCTAATTTCTGTATTT,pLKO.1,1455,3UTR,95,95,,,Y,64922,LRRC19,CCGGGCCTGGCTAATTTCTGTATTTCTCGAGAAATACAGAAATTAGCCAGGCTTTTTG,AATTCAAAAAGCCTGGCTAATTTCTGTATTTCTCGAGAAATACAGAAATTAGCCAGGC,n/a
human,101927131,LOC101927131,NR_110907.1,TRCN0000165534,NM_001012717.1-362s1c1,GAGACAGGGTTTCACCATGTT,pLKO.1,52,3UTR,95,95,,,Y,,,CCGGGAGACAGGGTTTCACCATGTTCTCGAGAACATGGTGAAACCCTGTCTCTTTTTG,AATTCAAAAAGAGACAGGGTTTCACCATGTTCTCGAGAACATGGTGAAACCCTGTCTC,n/a
human,101927131,LOC101927131,NR_110907.1,TRCN0000166101,NM_152340.1-404s1c1,GCTGGAGTACAATGGCACAAT,pLKO.1,1343,3UTR,95,95,,,Y,652276,LOC652276,CCGGGCTGGAGTACAATGGCACAATCTCGAGATTGTGCCATTGTACTCCAGCTTTTTG,AATTCAAAAAGCTGGAGTACAATGGCACAATCTCGAGATTGTGCCATTGTACTCCAGC,n/a
human,101927131,LOC101927131,NR_110907.1,TRCN0000139012,NM_152675.1-2010s1c1,CGCCTGTAATCCCAGAACTTT,pLKO.1,1970,3UTR,90,95,,,Y,284001,CCDC57,CCGGCGCCTGTAATCCCAGAACTTTCTCGAGAAAGTTCTGGGATTACAGGCGTTTTTG,AATTCAAAAACGCCTGTAATCCCAGAACTTTCTCGAGAAAGTTCTGGGATTACAGGCG,n/a
human,101927131,LOC101927131,NR_110907.1,TRCN0000163352,NM_152340.1-408s1c1,GAGTACAATGGCACAATCTTG,pLKO.1,1347,3UTR,90,95,,,Y,652276,LOC652276,CCGGGAGTACAATGGCACAATCTTGCTCGAGCAAGATTGTGCCATTGTACTCTTTTTG,AATTCAAAAAGAGTACAATGGCACAATCTTGCTCGAGCAAGATTGTGCCATTGTACTC,n/a
human,101927131,LOC101927131,NR_110907.1,TRCN0000141125,NM_153233.1-1432s1c1,CAGGTTCAAGAGATTCTCCTA,pLKO.1,1390,3UTR,90,95,,,Y,163183,SYNE4,CCGGCAGGTTCAAGAGATTCTCCTACTCGAGTAGGAGAATCTCTTGAACCTGTTTTTG,AATTCAAAAACAGGTTCAAGAGATTCTCCTACTCGAGTAGGAGAATCTCTTGAACCTG,n/a
human,101927131,LOC101927131,NR_110907.1,TRCN0000366268,NM_133976.2-474s21c1,ACTTTGTCACCTGGGTGGACT,pLKO_005,1329,3UTR,86,90,,,Y,102462,Imp3,CCGGACTTTGTCACCTGGGTGGACTCTCGAGAGTCCACCCAGGTGACAAAGTTTTTTG,AATTCAAAAAACTTTGTCACCTGGGTGGACTCTCGAGAGTCCACCCAGGTGACAAAGT,n/a
human,101927131,LOC101927131,NR_110907.1,TRCN0000105681,XM_359260.1-2191s1c1,CACCTGAATCTCAAAGACTTT,pLKO.1,2106,3UTR,81,90,,,Y,71709,Syde1,CCGGCACCTGAATCTCAAAGACTTTCTCGAGAAAGTCTTTGAGATTCAGGTGTTTTTG,AATTCAAAAACACCTGAATCTCAAAGACTTTCTCGAGAAAGTCTTTGAGATTCAGGTG,n/a
human,101927131,LOC101927131,NR_110907.1,TRCN0000321517,NM_008616.2-1760s21c1,CAAGGAGCTTCACTAAGTAAC,pLKO_005,418,3UTR,90,89,,,Y,22685,Zfp239,CCGGCAAGGAGCTTCACTAAGTAACCTCGAGGTTACTTAGTGAAGCTCCTTGTTTTTG,AATTCAAAAACAAGGAGCTTCACTAAGTAACCTCGAGGTTACTTAGTGAAGCTCCTTG,n/a
human,101927131,LOC101927131,NR_110907.1,TRCN0000072463,NM_001001563.1-2222s1c1,GCTACCATACCCAGCTAATTT,pLKO.1,17,3UTR,90,89,,,Y,92609,TIMM50,CCGGGCTACCATACCCAGCTAATTTCTCGAGAAATTAGCTGGGTATGGTAGCTTTTTG,AATTCAAAAAGCTACCATACCCAGCTAATTTCTCGAGAAATTAGCTGGGTATGGTAGC,n/a
human,101927131,LOC101927131,NR_110907.1,TRCN0000148148,NM_152654.1-1281s1c1,GAGACAGAGTTTCACCATATT,pLKO.1,52,3UTR,90,89,,,Y,199699,DAND5,CCGGGAGACAGAGTTTCACCATATTCTCGAGAATATGGTGAAACTCTGTCTCTTTTTG,AATTCAAAAAGAGACAGAGTTTCACCATATTCTCGAGAATATGGTGAAACTCTGTCTC,n/a
human,101927131,LOC101927131,NR_110907.1,TRCN0000073138,NM_032828.1-2399s1c1,GCCTCCCAAGTTCAACTGATT,pLKO.1,1384,3UTR,90,89,,,Y,84914,ZNF587,CCGGGCCTCCCAAGTTCAACTGATTCTCGAGAATCAGTTGAACTTGGGAGGCTTTTTG,AATTCAAAAAGCCTCCCAAGTTCAACTGATTCTCGAGAATCAGTTGAACTTGGGAGGC,n/a
human,101927131,LOC101927131,NR_110907.1,TRCN0000149509,NM_145283.1-707s1c1,GTTCAAGTGATTCTCTAGCCT,pLKO.1,1393,3UTR,90,89,,,Y,158046,NXNL2,CCGGGTTCAAGTGATTCTCTAGCCTCTCGAGAGGCTAGAGAATCACTTGAACTTTTTG,AATTCAAAAAGTTCAAGTGATTCTCTAGCCTCTCGAGAGGCTAGAGAATCACTTGAAC,n/a
human,101927131,LOC101927131,NR_110907.1,TRCN0000165704,NM_152340.1-413s1c1,CAATGGCACAATCTTGGCTCA,pLKO.1,1352,3UTR,90,89,,,Y,652276,LOC652276,CCGGCAATGGCACAATCTTGGCTCACTCGAGTGAGCCAAGATTGTGCCATTGTTTTTG,AATTCAAAAACAATGGCACAATCTTGGCTCACTCGAGTGAGCCAAGATTGTGCCATTG,n/a
human,101927131,LOC101927131,NR_110907.1,TRCN0000231957,NM_015911.2-132s21c1,TGGATGACTCAGAGGGTTCTT,pLKO_005,957,3UTR,85,89,,,Y,51058,ZNF691,CCGGTGGATGACTCAGAGGGTTCTTCTCGAGAAGAACCCTCTGAGTCATCCATTTTTG,AATTCAAAAATGGATGACTCAGAGGGTTCTTCTCGAGAAGAACCCTCTGAGTCATCCA,n/a
human,101927131,LOC101927131,NR_110907.1,TRCN0000097424,NM_025375.1-1441s1c1,GCTCAGATCCTGTAATCCCAA,pLKO.1,1965,3UTR,85,89,,,Y,66138,Wbscr22,CCGGGCTCAGATCCTGTAATCCCAACTCGAGTTGGGATTACAGGATCTGAGCTTTTTG,AATTCAAAAAGCTCAGATCCTGTAATCCCAACTCGAGTTGGGATTACAGGATCTGAGC,n/a
human,101927131,LOC101927131,NR_110907.1,TRCN0000271379,NM_014881.2-2619s21c1,GAGATCAGATCACCTTATTAA,pLKO_005,1118,3UTR,80,89,,,Y,9937,DCLRE1A,CCGGGAGATCAGATCACCTTATTAACTCGAGTTAATAAGGTGATCTGATCTCTTTTTG,AATTCAAAAAGAGATCAGATCACCTTATTAACTCGAGTTAATAAGGTGATCTGATCTC,n/a
human,101927131,LOC101927131,NR_110907.1,TRCN0000429433,NM_153265.2-1503s21c1,GCTGAGATCAAGAGTACAAAT,pLKO_005,2014,3UTR,80,89,,,Y,256364,EML3,CCGGGCTGAGATCAAGAGTACAAATCTCGAGATTTGTACTCTTGATCTCAGCTTTTTG,AATTCAAAAAGCTGAGATCAAGAGTACAAATCTCGAGATTTGTACTCTTGATCTCAGC,n/a
human,101927131,LOC101927131,NR_110907.1,TRCN0000134140,NM_152518.1-1143s1c1,CCTGGGTCTCAATTTCTTTAT,pLKO.1,1729,3UTR,82,86,,,Y,151009,LINC01106,CCGGCCTGGGTCTCAATTTCTTTATCTCGAGATAAAGAAATTGAGACCCAGGTTTTTG,AATTCAAAAACCTGGGTCTCAATTTCTTTATCTCGAGATAAAGAAATTGAGACCCAGG,n/a
human,101927131,LOC101927131,NR_110907.1,TRCN0000167865,NM_153235.2-1392s1c1,GCTAAAGAATATGAGTGCTTT,pLKO.1,484,3UTR,81,85,,,Y,167838,TXLNB,CCGGGCTAAAGAATATGAGTGCTTTCTCGAGAAAGCACTCATATTCTTTAGCTTTTTG,AATTCAAAAAGCTAAAGAATATGAGTGCTTTCTCGAGAAAGCACTCATATTCTTTAGC,n/a
human,101927131,LOC101927131,NR_110907.1,TRCN0000034004,NM_032431.1-2804s1c1,TGAATGCTTAATCCCGGGAAA,pLKO.1,2130,3UTR,81,85,,,Y,84447,SYVN1,CCGGTGAATGCTTAATCCCGGGAAACTCGAGTTTCCCGGGATTAAGCATTCATTTTTG,AATTCAAAAATGAATGCTTAATCCCGGGAAACTCGAGTTTCCCGGGATTAAGCATTCA,n/a
human,101927131,LOC101927131,NR_110907.1,TRCN0000247806,NM_025836.3-1706s21c1,CCGGCTGCCACATCACAAATT,pLKO_005,990,3UTR,77,85,,,Y,66905,Plin3,CCGGCCGGCTGCCACATCACAAATTCTCGAGAATTTGTGATGTGGCAGCCGGTTTTTG,AATTCAAAAACCGGCTGCCACATCACAAATTCTCGAGAATTTGTGATGTGGCAGCCGG,n/a
human,101927131,LOC101927131,NR_110907.1,TRCN0000081450,NM_007433.2-306s1c1,CATCAGCTAAGAACCTCGTTA,pLKO.1,1000,3UTR,77,85,,,Y,11650,Alppl2,CCGGCATCAGCTAAGAACCTCGTTACTCGAGTAACGAGGTTCTTAGCTGATGTTTTTG,AATTCAAAAACATCAGCTAAGAACCTCGTTACTCGAGTAACGAGGTTCTTAGCTGATG,n/a
human,101927131,LOC101927131,NR_110907.1,TRCN0000031769,NM_021456.1-1194s1c1,CCAATTCTTAACATCTCTGAA,pLKO.1,1713,3UTR,77,85,,,Y,12623,Ces1g,CCGGCCAATTCTTAACATCTCTGAACTCGAGTTCAGAGATGTTAAGAATTGGTTTTTG,AATTCAAAAACCAATTCTTAACATCTCTGAACTCGAGTTCAGAGATGTTAAGAATTGG,n/a
human,101927131,LOC101927131,NR_110907.1,TRCN0000011172,NM_152489.1-990s1c1,GAAATTCTTAACCACTCTGAA,pLKO.1,1713,3UTR,77,85,,,Y,148581,UBE2U,CCGGGAAATTCTTAACCACTCTGAACTCGAGTTCAGAGTGGTTAAGAATTTCTTTTTG,AATTCAAAAAGAAATTCTTAACCACTCTGAACTCGAGTTCAGAGTGGTTAAGAATTTC,n/a
human,101927131,LOC101927131,NR_110907.1,TRCN0000433771,NM_001805.2-882s21c1,GCTGGAGTACATGGCAGAGAA,pLKO_005,1343,3UTR,77,85,,,Y,1053,CEBPE,CCGGGCTGGAGTACATGGCAGAGAACTCGAGTTCTCTGCCATGTACTCCAGCTTTTTG,AATTCAAAAAGCTGGAGTACATGGCAGAGAACTCGAGTTCTCTGCCATGTACTCCAGC,n/a
human,101927131,LOC101927131,NR_110907.1,TRCN0000188246,NM_146568.1-636s1c1,CATCTTGACCTCCTACCTCTT,pLKO.1,1512,3UTR,77,85,,,Y,258561,Olfr1012,CCGGCATCTTGACCTCCTACCTCTTCTCGAGAAGAGGTAGGAGGTCAAGATGTTTTTG,AATTCAAAAACATCTTGACCTCCTACCTCTTCTCGAGAAGAGGTAGGAGGTCAAGATG,n/a
