Taxon,"Gene ID","Gene Symbol",Transcript,"Clone ID","Legacy Clone Name","Target Seq",Vector,"Match Position","Match Region","Match %","SDR Match %","Intrinsic Score","Adjusted Score","Matches Other Gene in Same Taxon?","Orig. Target Gene ID","Orig. Target Gene Symbol","Forward Oligo Sequence","Reverse Oligo Sequence",Addgene
human,388815,MIR99AHG,NR_136552.1,TRCN0000167664,NM_001005732.1-335s1c1,GATGTGAAGATGAGAAGAAAT,pLKO.1,216,3UTR,100,100,13.2,9.24,N,388815,MIR99AHG,CCGGGATGTGAAGATGAGAAGAAATCTCGAGATTTCTTCTCATCTTCACATCTTTTTG,AATTCAAAAAGATGTGAAGATGAGAAGAAATCTCGAGATTTCTTCTCATCTTCACATC,n/a
human,388815,MIR99AHG,NR_136552.1,TRCN0000166837,NM_001005732.1-635s1c1,CCTTTGAATTAGCTTTCCCTA,pLKO.1,588,3UTR,100,100,2.64,1.848,N,388815,MIR99AHG,CCGGCCTTTGAATTAGCTTTCCCTACTCGAGTAGGGAAAGCTAATTCAAAGGTTTTTG,AATTCAAAAACCTTTGAATTAGCTTTCCCTACTCGAGTAGGGAAAGCTAATTCAAAGG,n/a
human,388815,MIR99AHG,NR_136552.1,TRCN0000242371,NM_001081422.1-3101s21c1,GAGCTAAGTTAGCATCAATTA,pLKO_005,946,3UTR,90,90,,,N,665775,Bod1l,CCGGGAGCTAAGTTAGCATCAATTACTCGAGTAATTGATGCTAACTTAGCTCTTTTTG,AATTCAAAAAGAGCTAAGTTAGCATCAATTACTCGAGTAATTGATGCTAACTTAGCTC,n/a
human,388815,MIR99AHG,NR_136552.1,TRCN0000135293,NM_001006655.1-1404s1c1,CCTCAGACACTCATGGATTAT,pLKO.1,1981,3UTR,85,89,,,Y,25854,FAM149A,CCGGCCTCAGACACTCATGGATTATCTCGAGATAATCCATGAGTGTCTGAGGTTTTTG,AATTCAAAAACCTCAGACACTCATGGATTATCTCGAGATAATCCATGAGTGTCTGAGG,n/a
human,388815,MIR99AHG,NR_136552.1,TRCN0000151473,NM_004182.2-369s1c1,GAAGCTCTCAAGTTCATTGAT,pLKO.1,2813,3UTR,85,89,,,Y,8409,UXT,CCGGGAAGCTCTCAAGTTCATTGATCTCGAGATCAATGAACTTGAGAGCTTCTTTTTG,AATTCAAAAAGAAGCTCTCAAGTTCATTGATCTCGAGATCAATGAACTTGAGAGCTTC,n/a
human,388815,MIR99AHG,NR_136552.1,TRCN0000162029,NM_001010976.1-469s1c1,CAAGAATGGAACAAGAAGACA,pLKO.1,385,3UTR,85,89,,,Y,149950,NOL4L-DT,CCGGCAAGAATGGAACAAGAAGACACTCGAGTGTCTTCTTGTTCCATTCTTGTTTTTG,AATTCAAAAACAAGAATGGAACAAGAAGACACTCGAGTGTCTTCTTGTTCCATTCTTG,n/a
human,388815,MIR99AHG,NR_136552.1,TRCN0000159476,NM_001012503.1-713s1c1,CAAATTCTCTTCCCAAGTCAA,pLKO.1,2231,3UTR,85,89,,,Y,440050,KRTAP5-7,CCGGCAAATTCTCTTCCCAAGTCAACTCGAGTTGACTTGGGAAGAGAATTTGTTTTTG,AATTCAAAAACAAATTCTCTTCCCAAGTCAACTCGAGTTGACTTGGGAAGAGAATTTG,n/a
human,388815,MIR99AHG,NR_136552.1,TRCN0000125589,NM_028829.3-1914s1c1,GCCAAGTATAACCTTGCCCTA,pLKO.1,1262,3UTR,80,89,,,N,74229,Paqr8,CCGGGCCAAGTATAACCTTGCCCTACTCGAGTAGGGCAAGGTTATACTTGGCTTTTTG,AATTCAAAAAGCCAAGTATAACCTTGCCCTACTCGAGTAGGGCAAGGTTATACTTGGC,n/a
human,388815,MIR99AHG,NR_136552.1,TRCN0000003383,NM_003338.x-1604s1c1,GCCATTAGTCACCATTAGTTA,pLKO.1,610,3UTR,80,89,,,Y,7321,UBE2D1,CCGGGCCATTAGTCACCATTAGTTACTCGAGTAACTAATGGTGACTAATGGCTTTTTG,AATTCAAAAAGCCATTAGTCACCATTAGTTACTCGAGTAACTAATGGTGACTAATGGC,n/a
human,388815,MIR99AHG,NR_136552.1,TRCN0000219924,NM_194249.1-582s1c1,CAGATCGCTCTGCTCAAATTC,pLKO.1,1423,3UTR,80,89,,,Y,373863,DND1,CCGGCAGATCGCTCTGCTCAAATTCCTCGAGGAATTTGAGCAGAGCGATCTGTTTTTG,AATTCAAAAACAGATCGCTCTGCTCAAATTCCTCGAGGAATTTGAGCAGAGCGATCTG,n/a
human,388815,MIR99AHG,NR_136552.1,TRCN0000015092,NM_003203.3-909s1c1,CCATTTACTCTAAGACCTCAA,pLKO.1,3556,3UTR,80,89,,,Y,6936,GCFC2,CCGGCCATTTACTCTAAGACCTCAACTCGAGTTGAGGTCTTAGAGTAAATGGTTTTTG,AATTCAAAAACCATTTACTCTAAGACCTCAACTCGAGTTGAGGTCTTAGAGTAAATGG,n/a
human,388815,MIR99AHG,NR_136552.1,TRCN0000412367,NM_145398.2-1567s21c1,TAGAGTGTGTCAGGTCTTATT,pLKO_005,2387,3UTR,80,89,,,Y,213819,Casd1,CCGGTAGAGTGTGTCAGGTCTTATTCTCGAGAATAAGACCTGACACACTCTATTTTTG,AATTCAAAAATAGAGTGTGTCAGGTCTTATTCTCGAGAATAAGACCTGACACACTCTA,n/a
human,388815,MIR99AHG,NR_136552.1,TRCN0000177061,NM_207251.1-406s1c1,GATGCCTTCTATTATGTGTGT,pLKO.1,3301,3UTR,80,89,,,Y,268391,A830031A19Rik,CCGGGATGCCTTCTATTATGTGTGTCTCGAGACACACATAATAGAAGGCATCTTTTTG,AATTCAAAAAGATGCCTTCTATTATGTGTGTCTCGAGACACACATAATAGAAGGCATC,n/a
human,388815,MIR99AHG,NR_136552.1,TRCN0000426340,NM_139319.2-1422s21c1,GAGGACAATTGGCTGATTATT,pLKO_005,2738,3UTR,81,85,,,Y,246213,SLC17A8,CCGGGAGGACAATTGGCTGATTATTCTCGAGAATAATCAGCCAATTGTCCTCTTTTTG,AATTCAAAAAGAGGACAATTGGCTGATTATTCTCGAGAATAATCAGCCAATTGTCCTC,n/a
human,388815,MIR99AHG,NR_136552.1,TRCN0000234378,NM_198076.4-476s21c1,CAATATTGTATGGTTCATTAG,pLKO_005,4369,3UTR,81,85,,,Y,116228,COX20,CCGGCAATATTGTATGGTTCATTAGCTCGAGCTAATGAACCATACAATATTGTTTTTG,AATTCAAAAACAATATTGTATGGTTCATTAGCTCGAGCTAATGAACCATACAATATTG,n/a
human,388815,MIR99AHG,NR_136552.1,TRCN0000175686,NM_029018.2-1001s1c1,GCCATTTACTTTCAACCTCTA,pLKO.1,3555,3UTR,77,85,,,N,74603,Cd200r3,CCGGGCCATTTACTTTCAACCTCTACTCGAGTAGAGGTTGAAAGTAAATGGCTTTTTG,AATTCAAAAAGCCATTTACTTTCAACCTCTACTCGAGTAGAGGTTGAAAGTAAATGGC,n/a
human,388815,MIR99AHG,NR_136552.1,TRCN0000120617,NM_153057.2-3847s1c1,CCTGCTGAACACAATTTATTT,pLKO.1,2657,3UTR,77,85,,,Y,211548,Nomo1,CCGGCCTGCTGAACACAATTTATTTCTCGAGAAATAAATTGTGTTCAGCAGGTTTTTG,AATTCAAAAACCTGCTGAACACAATTTATTTCTCGAGAAATAAATTGTGTTCAGCAGG,n/a
human,388815,MIR99AHG,NR_136552.1,TRCN0000319949,NM_153057.4-3968s21c1,CCTGCTGAACACAATTTATTT,pLKO_005,2657,3UTR,77,85,,,Y,211548,Nomo1,CCGGCCTGCTGAACACAATTTATTTCTCGAGAAATAAATTGTGTTCAGCAGGTTTTTG,AATTCAAAAACCTGCTGAACACAATTTATTTCTCGAGAAATAAATTGTGTTCAGCAGG,n/a
human,388815,MIR99AHG,NR_136552.1,TRCN0000060234,NM_033412.1-497s1c1,GCACTTATGTTTGGTCTGTAT,pLKO.1,3627,3UTR,77,85,,,Y,92014,SLC25A51,CCGGGCACTTATGTTTGGTCTGTATCTCGAGATACAGACCAAACATAAGTGCTTTTTG,AATTCAAAAAGCACTTATGTTTGGTCTGTATCTCGAGATACAGACCAAACATAAGTGC,n/a
human,388815,MIR99AHG,NR_136552.1,TRCN0000133722,NM_001034172.1-361s1c1,GCACTTATGTTTGGTCTGTAT,pLKO.1,3627,3UTR,77,85,,,Y,147407,SLC25A52,CCGGGCACTTATGTTTGGTCTGTATCTCGAGATACAGACCAAACATAAGTGCTTTTTG,AATTCAAAAAGCACTTATGTTTGGTCTGTATCTCGAGATACAGACCAAACATAAGTGC,n/a
human,388815,MIR99AHG,NR_136552.1,TRCN0000140239,NM_025042.2-710s1c1,GCTGAGGTTAGAAGGGAAAGA,pLKO.1,736,3UTR,77,85,,,Y,,,CCGGGCTGAGGTTAGAAGGGAAAGACTCGAGTCTTTCCCTTCTAACCTCAGCTTTTTG,AATTCAAAAAGCTGAGGTTAGAAGGGAAAGACTCGAGTCTTTCCCTTCTAACCTCAGC,n/a
