Taxon,"Gene ID","Gene Symbol",Transcript,"Clone ID","Legacy Clone Name","Target Seq",Vector,"Match Position","Match Region","Match %","SDR Match %","Intrinsic Score","Adjusted Score","Matches Other Gene in Same Taxon?","Orig. Target Gene ID","Orig. Target Gene Symbol","Forward Oligo Sequence","Reverse Oligo Sequence",Addgene
human,105375013,HCG20,NR_138037.1,TRCN0000156198,NM_004927.2-974s1c1,CCTCTTGAGTAGCTGGGATTA,pLKO.1,593,3UTR,100,100,10.8,5.4,Y,740,MRPL49,CCGGCCTCTTGAGTAGCTGGGATTACTCGAGTAATCCCAGCTACTCAAGAGGTTTTTG,AATTCAAAAACCTCTTGAGTAGCTGGGATTACTCGAGTAATCCCAGCTACTCAAGAGG,n/a
human,105375013,HCG20,NR_138037.1,TRCN0000276507,NM_004927.2-974s21c1,CCTCTTGAGTAGCTGGGATTA,pLKO_005,593,3UTR,100,100,10.8,5.4,Y,740,MRPL49,CCGGCCTCTTGAGTAGCTGGGATTACTCGAGTAATCCCAGCTACTCAAGAGGTTTTTG,AATTCAAAAACCTCTTGAGTAGCTGGGATTACTCGAGTAATCCCAGCTACTCAAGAGG,n/a
human,105375013,HCG20,NR_138037.1,TRCN0000165027,NM_001013636.1-513s1c1,GAACTCCTGACCTCAAGTGAT,pLKO.1,696,3UTR,95,95,,,Y,387873,LOC387873,CCGGGAACTCCTGACCTCAAGTGATCTCGAGATCACTTGAGGTCAGGAGTTCTTTTTG,AATTCAAAAAGAACTCCTGACCTCAAGTGATCTCGAGATCACTTGAGGTCAGGAGTTC,n/a
human,105375013,HCG20,NR_138037.1,TRCN0000201485,NM_178264.2-1429s1c1,CCTCTTGAGTGCTGGGATTAA,pLKO.1,593,3UTR,90,95,,,Y,352968,D830050J10Rik,CCGGCCTCTTGAGTGCTGGGATTAACTCGAGTTAATCCCAGCACTCAAGAGGTTTTTG,AATTCAAAAACCTCTTGAGTGCTGGGATTAACTCGAGTTAATCCCAGCACTCAAGAGG,n/a
human,105375013,HCG20,NR_138037.1,TRCN0000155836,NM_198582.1-3275s1c1,CCCAAAGTGCTGGGATTACAA,pLKO.1,733,3UTR,90,95,,,Y,377007,KLHL30,CCGGCCCAAAGTGCTGGGATTACAACTCGAGTTGTAATCCCAGCACTTTGGGTTTTTG,AATTCAAAAACCCAAAGTGCTGGGATTACAACTCGAGTTGTAATCCCAGCACTTTGGG,n/a
human,105375013,HCG20,NR_138037.1,TRCN0000141025,NM_152361.1-835s1c1,CCCAAAGTGCTGGGATTACTT,pLKO.1,733,3UTR,85,95,,,Y,126272,EID2B,CCGGCCCAAAGTGCTGGGATTACTTCTCGAGAAGTAATCCCAGCACTTTGGGTTTTTG,AATTCAAAAACCCAAAGTGCTGGGATTACTTCTCGAGAAGTAATCCCAGCACTTTGGG,n/a
human,105375013,HCG20,NR_138037.1,TRCN0000165534,NM_001012717.1-362s1c1,GAGACAGGGTTTCACCATGTT,pLKO.1,659,3UTR,90,90,,,Y,,,CCGGGAGACAGGGTTTCACCATGTTCTCGAGAACATGGTGAAACCCTGTCTCTTTTTG,AATTCAAAAAGAGACAGGGTTTCACCATGTTCTCGAGAACATGGTGAAACCCTGTCTC,n/a
human,105375013,HCG20,NR_138037.1,TRCN0000039174,NM_029669.2-1752s1c1,GCCTCTTGAGAGCTGTGATTT,pLKO.1,592,3UTR,86,90,,,N,76594,Dnajc18,CCGGGCCTCTTGAGAGCTGTGATTTCTCGAGAAATCACAGCTCTCAAGAGGCTTTTTG,AATTCAAAAAGCCTCTTGAGAGCTGTGATTTCTCGAGAAATCACAGCTCTCAAGAGGC,n/a
human,105375013,HCG20,NR_138037.1,TRCN0000441488,NM_030641.3-378s21c1,GGAGCTACAAGACGGAGATCT,pLKO_005,87,3UTR,86,90,,,Y,80830,APOL6,CCGGGGAGCTACAAGACGGAGATCTCTCGAGAGATCTCCGTCTTGTAGCTCCTTTTTG,AATTCAAAAAGGAGCTACAAGACGGAGATCTCTCGAGAGATCTCCGTCTTGTAGCTCC,n/a
human,105375013,HCG20,NR_138037.1,TRCN0000000816,NM_004409.x-1031s1c1,AGCGGTAGTGAAGATGAAGCA,pLKO.1,925,3UTR,86,90,,,Y,1760,DMPK,CCGGAGCGGTAGTGAAGATGAAGCACTCGAGTGCTTCATCTTCACTACCGCTTTTTTG,AATTCAAAAAAGCGGTAGTGAAGATGAAGCACTCGAGTGCTTCATCTTCACTACCGCT,n/a
human,105375013,HCG20,NR_138037.1,TRCN0000374424,NM_013676.1-2510s21c1,GCTGAGGAGGAATACGAATAT,pLKO_005,1144,3UTR,81,90,,,N,20924,Supt5,CCGGGCTGAGGAGGAATACGAATATCTCGAGATATTCGTATTCCTCCTCAGCTTTTTG,AATTCAAAAAGCTGAGGAGGAATACGAATATCTCGAGATATTCGTATTCCTCCTCAGC,n/a
human,105375013,HCG20,NR_138037.1,TRCN0000156872,NM_058219.2-1204s1c1,GCAACCACACCTGGCTAATTT,pLKO.1,623,3UTR,90,89,,,Y,118460,EXOSC6,CCGGGCAACCACACCTGGCTAATTTCTCGAGAAATTAGCCAGGTGTGGTTGCTTTTTG,AATTCAAAAAGCAACCACACCTGGCTAATTTCTCGAGAAATTAGCCAGGTGTGGTTGC,n/a
human,105375013,HCG20,NR_138037.1,TRCN0000150833,NM_207309.1-2994s1c1,GCCTGGCTAATTCTTTGTATT,pLKO.1,631,3UTR,90,89,,,Y,91373,UAP1L1,CCGGGCCTGGCTAATTCTTTGTATTCTCGAGAATACAAAGAATTAGCCAGGCTTTTTG,AATTCAAAAAGCCTGGCTAATTCTTTGTATTCTCGAGAATACAAAGAATTAGCCAGGC,n/a
human,105375013,HCG20,NR_138037.1,TRCN0000140610,NM_025042.2-931s1c1,GCCTCTCAGGTTCAAGCAATT,pLKO.1,559,3UTR,90,89,,,Y,,,CCGGGCCTCTCAGGTTCAAGCAATTCTCGAGAATTGCTTGAACCTGAGAGGCTTTTTG,AATTCAAAAAGCCTCTCAGGTTCAAGCAATTCTCGAGAATTGCTTGAACCTGAGAGGC,n/a
human,105375013,HCG20,NR_138037.1,TRCN0000430981,NM_173537.2-3266s21c1,GCCACCATGCCTGGCTAATTT,pLKO_005,623,3UTR,90,89,,,Y,84163,GTF2IRD2,CCGGGCCACCATGCCTGGCTAATTTCTCGAGAAATTAGCCAGGCATGGTGGCTTTTTG,AATTCAAAAAGCCACCATGCCTGGCTAATTTCTCGAGAAATTAGCCAGGCATGGTGGC,n/a
human,105375013,HCG20,NR_138037.1,TRCN0000204533,NM_001013675.1-1987s1c1,CCTCCCAAAGTGCTGGAATTA,pLKO.1,730,3UTR,90,89,,,Y,400891,LRRC74B,CCGGCCTCCCAAAGTGCTGGAATTACTCGAGTAATTCCAGCACTTTGGGAGGTTTTTG,AATTCAAAAACCTCCCAAAGTGCTGGAATTACTCGAGTAATTCCAGCACTTTGGGAGG,n/a
human,105375013,HCG20,NR_138037.1,TRCN0000082462,XM_371492.2-638s1c1,CCTCCCAAAGTGCCAGGATTA,pLKO.1,730,3UTR,90,89,,,Y,388949,LOC388949,CCGGCCTCCCAAAGTGCCAGGATTACTCGAGTAATCCTGGCACTTTGGGAGGTTTTTG,AATTCAAAAACCTCCCAAAGTGCCAGGATTACTCGAGTAATCCTGGCACTTTGGGAGG,n/a
human,105375013,HCG20,NR_138037.1,TRCN0000072628,NM_016065.3-1636s1c1,CCTCCCAAAGTGCTAGGATTA,pLKO.1,730,3UTR,90,89,,,Y,51021,MRPS16,CCGGCCTCCCAAAGTGCTAGGATTACTCGAGTAATCCTAGCACTTTGGGAGGTTTTTG,AATTCAAAAACCTCCCAAAGTGCTAGGATTACTCGAGTAATCCTAGCACTTTGGGAGG,n/a
human,105375013,HCG20,NR_138037.1,TRCN0000165774,NM_001012391.1-946s1c1,CCTCCTAAGTAGCTGGGATTA,pLKO.1,593,3UTR,90,89,,,Y,100652781,SNX29P1,CCGGCCTCCTAAGTAGCTGGGATTACTCGAGTAATCCCAGCTACTTAGGAGGTTTTTG,AATTCAAAAACCTCCTAAGTAGCTGGGATTACTCGAGTAATCCCAGCTACTTAGGAGG,n/a
human,105375013,HCG20,NR_138037.1,TRCN0000139826,NM_133477.1-4628s1c1,CCTCCTGAATAGCTGGGATTA,pLKO.1,593,3UTR,90,89,,,Y,171024,SYNPO2,CCGGCCTCCTGAATAGCTGGGATTACTCGAGTAATCCCAGCTATTCAGGAGGTTTTTG,AATTCAAAAACCTCCTGAATAGCTGGGATTACTCGAGTAATCCCAGCTATTCAGGAGG,n/a
human,105375013,HCG20,NR_138037.1,TRCN0000139201,NM_032120.1-1391s1c1,CCTCCTGAGTATCTGGGATTA,pLKO.1,593,3UTR,90,89,,,Y,84060,RBM48,CCGGCCTCCTGAGTATCTGGGATTACTCGAGTAATCCCAGATACTCAGGAGGTTTTTG,AATTCAAAAACCTCCTGAGTATCTGGGATTACTCGAGTAATCCCAGATACTCAGGAGG,n/a
human,105375013,HCG20,NR_138037.1,TRCN0000130981,NM_152906.2-1811s1c1,CCTCCTGATTAGCTGGGATTA,pLKO.1,593,3UTR,90,89,,,Y,128989,TANGO2,CCGGCCTCCTGATTAGCTGGGATTACTCGAGTAATCCCAGCTAATCAGGAGGTTTTTG,AATTCAAAAACCTCCTGATTAGCTGGGATTACTCGAGTAATCCCAGCTAATCAGGAGG,n/a
human,105375013,HCG20,NR_138037.1,TRCN0000060503,NM_001001414.1-1521s1c1,CCTCTCAAGTAGCTGGGATTA,pLKO.1,593,3UTR,90,89,,,Y,342897,NCCRP1,CCGGCCTCTCAAGTAGCTGGGATTACTCGAGTAATCCCAGCTACTTGAGAGGTTTTTG,AATTCAAAAACCTCTCAAGTAGCTGGGATTACTCGAGTAATCCCAGCTACTTGAGAGG,n/a
human,105375013,HCG20,NR_138037.1,TRCN0000155576,NM_198582.1-3137s1c1,CCTCTCAAGTAGCTGGGATTA,pLKO.1,593,3UTR,90,89,,,Y,377007,KLHL30,CCGGCCTCTCAAGTAGCTGGGATTACTCGAGTAATCCCAGCTACTTGAGAGGTTTTTG,AATTCAAAAACCTCTCAAGTAGCTGGGATTACTCGAGTAATCCCAGCTACTTGAGAGG,n/a
human,105375013,HCG20,NR_138037.1,TRCN0000165697,NM_017842.1-943s1c1,CCTCTCAAGTAGCTGGGATTA,pLKO.1,593,3UTR,90,89,,,Y,55652,SLC48A1,CCGGCCTCTCAAGTAGCTGGGATTACTCGAGTAATCCCAGCTACTTGAGAGGTTTTTG,AATTCAAAAACCTCTCAAGTAGCTGGGATTACTCGAGTAATCCCAGCTACTTGAGAGG,n/a
human,105375013,HCG20,NR_138037.1,TRCN0000164801,NM_016534.2-1646s1c1,CCTCCCAAAGTACTGGGATTA,pLKO.1,730,3UTR,90,89,,,Y,51275,MAPKAPK5-AS1,CCGGCCTCCCAAAGTACTGGGATTACTCGAGTAATCCCAGTACTTTGGGAGGTTTTTG,AATTCAAAAACCTCCCAAAGTACTGGGATTACTCGAGTAATCCCAGTACTTTGGGAGG,n/a
human,105375013,HCG20,NR_138037.1,TRCN0000008902,NM_016540.2-2291s1c1,CCTCCCAAAGTGTTGGGATTA,pLKO.1,730,3UTR,90,89,,,Y,10888,GPR83,CCGGCCTCCCAAAGTGTTGGGATTACTCGAGTAATCCCAACACTTTGGGAGGTTTTTG,AATTCAAAAACCTCCCAAAGTGTTGGGATTACTCGAGTAATCCCAACACTTTGGGAGG,n/a
human,105375013,HCG20,NR_138037.1,TRCN0000156315,NM_020702.1-3633s1c1,CCTCCCAAAGTGTTGGGATTA,pLKO.1,730,3UTR,90,89,,,Y,57462,MYORG,CCGGCCTCCCAAAGTGTTGGGATTACTCGAGTAATCCCAACACTTTGGGAGGTTTTTG,AATTCAAAAACCTCCCAAAGTGTTGGGATTACTCGAGTAATCCCAACACTTTGGGAGG,n/a
human,105375013,HCG20,NR_138037.1,TRCN0000116227,NM_024930.1-2895s1c1,CCTCCCAAAGTTCTGGGATTA,pLKO.1,730,3UTR,90,89,,,Y,79993,ELOVL7,CCGGCCTCCCAAAGTTCTGGGATTACTCGAGTAATCCCAGAACTTTGGGAGGTTTTTG,AATTCAAAAACCTCCCAAAGTTCTGGGATTACTCGAGTAATCCCAGAACTTTGGGAGG,n/a
human,105375013,HCG20,NR_138037.1,TRCN0000164591,NM_003281.3-2102s1c1,CCTCCCAAAGTTCTGGGATTA,pLKO.1,730,3UTR,90,89,,,Y,7135,TNNI1,CCGGCCTCCCAAAGTTCTGGGATTACTCGAGTAATCCCAGAACTTTGGGAGGTTTTTG,AATTCAAAAACCTCCCAAAGTTCTGGGATTACTCGAGTAATCCCAGAACTTTGGGAGG,n/a
human,105375013,HCG20,NR_138037.1,TRCN0000040213,NM_000618.2-6169s1c1,CCTCCCAAATTGCTGGGATTA,pLKO.1,730,3UTR,90,89,,,Y,3479,IGF1,CCGGCCTCCCAAATTGCTGGGATTACTCGAGTAATCCCAGCAATTTGGGAGGTTTTTG,AATTCAAAAACCTCCCAAATTGCTGGGATTACTCGAGTAATCCCAGCAATTTGGGAGG,n/a
human,105375013,HCG20,NR_138037.1,TRCN0000238542,XM_136331.7-2123s21c1,CCCAATGTTCATGCAATTATT,pLKO_005,563,3UTR,85,89,,,N,,,CCGGCCCAATGTTCATGCAATTATTCTCGAGAATAATTGCATGAACATTGGGTTTTTG,AATTCAAAAACCCAATGTTCATGCAATTATTCTCGAGAATAATTGCATGAACATTGGG,n/a
human,105375013,HCG20,NR_138037.1,TRCN0000072357,NM_020143.2-313s1c1,GATACACACCATTGAAAGAAA,pLKO.1,1166,3UTR,85,89,,,Y,56902,PNO1,CCGGGATACACACCATTGAAAGAAACTCGAGTTTCTTTCAATGGTGTGTATCTTTTTG,AATTCAAAAAGATACACACCATTGAAAGAAACTCGAGTTTCTTTCAATGGTGTGTATC,n/a
human,105375013,HCG20,NR_138037.1,TRCN0000424590,NM_033067.1-91s21c1,GAGATGCAGGAACCATGGCTT,pLKO_005,950,3UTR,85,89,,,Y,63948,DMRTB1,CCGGGAGATGCAGGAACCATGGCTTCTCGAGAAGCCATGGTTCCTGCATCTCTTTTTG,AATTCAAAAAGAGATGCAGGAACCATGGCTTCTCGAGAAGCCATGGTTCCTGCATCTC,n/a
human,105375013,HCG20,NR_138037.1,TRCN0000162795,NM_017842.1-1079s1c1,CTTCCAAAGTGCTGGGATTAT,pLKO.1,731,3UTR,85,89,,,Y,55652,SLC48A1,CCGGCTTCCAAAGTGCTGGGATTATCTCGAGATAATCCCAGCACTTTGGAAGTTTTTG,AATTCAAAAACTTCCAAAGTGCTGGGATTATCTCGAGATAATCCCAGCACTTTGGAAG,n/a
human,105375013,HCG20,NR_138037.1,TRCN0000140657,NM_012099.1-2957s1c1,CCTCCCAAAGTGCTAGGATAA,pLKO.1,730,3UTR,85,89,,,Y,10849,CD3EAP,CCGGCCTCCCAAAGTGCTAGGATAACTCGAGTTATCCTAGCACTTTGGGAGGTTTTTG,AATTCAAAAACCTCCCAAAGTGCTAGGATAACTCGAGTTATCCTAGCACTTTGGGAGG,n/a
human,105375013,HCG20,NR_138037.1,TRCN0000157407,NM_001003795.1-3187s1c1,GATCTCGGCTTACTGCAACTT,pLKO.1,536,3UTR,85,89,,,Y,389524,GTF2IRD2B,CCGGGATCTCGGCTTACTGCAACTTCTCGAGAAGTTGCAGTAAGCCGAGATCTTTTTG,AATTCAAAAAGATCTCGGCTTACTGCAACTTCTCGAGAAGTTGCAGTAAGCCGAGATC,n/a
human,105375013,HCG20,NR_138037.1,TRCN0000168807,NM_178520.2-2253s1c1,GCTGATCTCAAACTCCTGATA,pLKO.1,687,3UTR,80,89,,,Y,284186,TMEM105,CCGGGCTGATCTCAAACTCCTGATACTCGAGTATCAGGAGTTTGAGATCAGCTTTTTG,AATTCAAAAAGCTGATCTCAAACTCCTGATACTCGAGTATCAGGAGTTTGAGATCAGC,n/a
human,105375013,HCG20,NR_138037.1,TRCN0000079173,NM_023420.1-2430s1c1,CCCAAGAAGAAACATTGCAAT,pLKO.1,774,3UTR,78,86,,,Y,68018,Col4a3bp,CCGGCCCAAGAAGAAACATTGCAATCTCGAGATTGCAATGTTTCTTCTTGGGTTTTTG,AATTCAAAAACCCAAGAAGAAACATTGCAATCTCGAGATTGCAATGTTTCTTCTTGGG,n/a
human,105375013,HCG20,NR_138037.1,TRCN0000177191,NM_016881.1-466s1c1,GCCAAGAAGAACGAATTGAAT,pLKO.1,774,3UTR,81,85,,,Y,54128,Pmm2,CCGGGCCAAGAAGAACGAATTGAATCTCGAGATTCAATTCGTTCTTCTTGGCTTTTTG,AATTCAAAAAGCCAAGAAGAACGAATTGAATCTCGAGATTCAATTCGTTCTTCTTGGC,n/a
human,105375013,HCG20,NR_138037.1,TRCN0000055137,NM_134032.1-545s1c1,CCTGCCACCACCCTGGAGAGT,pLKO.1,620,3UTR,81,85,,,Y,103889,Hoxb2,CCGGCCTGCCACCACCCTGGAGAGTCTCGAGACTCTCCAGGGTGGTGGCAGGTTTTTG,AATTCAAAAACCTGCCACCACCCTGGAGAGTCTCGAGACTCTCCAGGGTGGTGGCAGG,n/a
human,105375013,HCG20,NR_138037.1,TRCN0000269053,NM_001033980.1-360s21c1,TTGCCAAAGTGCAGGATTATC,pLKO_005,731,3UTR,77,85,,,Y,436062,Fam92b,CCGGTTGCCAAAGTGCAGGATTATCCTCGAGGATAATCCTGCACTTTGGCAATTTTTG,AATTCAAAAATTGCCAAAGTGCAGGATTATCCTCGAGGATAATCCTGCACTTTGGCAA,n/a
human,105375013,HCG20,NR_138037.1,TRCN0000381845,NM_018467.3-290s21c1,TGACCTCCTCCTCAGAGAAAG,pLKO_005,334,3UTR,77,85,,,Y,55850,USE1,CCGGTGACCTCCTCCTCAGAGAAAGCTCGAGCTTTCTCTGAGGAGGAGGTCATTTTTG,AATTCAAAAATGACCTCCTCCTCAGAGAAAGCTCGAGCTTTCTCTGAGGAGGAGGTCA,n/a
human,105375013,HCG20,NR_138037.1,TRCN0000049119,XM_497573.1-255s1c1,CCAAGAAGAATGCATTGAGTT,pLKO.1,775,3UTR,77,85,,,Y,441809,LOC441809,CCGGCCAAGAAGAATGCATTGAGTTCTCGAGAACTCAATGCATTCTTCTTGGTTTTTG,AATTCAAAAACCAAGAAGAATGCATTGAGTTCTCGAGAACTCAATGCATTCTTCTTGG,n/a
human,105375013,HCG20,NR_138037.1,TRCN0000052497,XM_496139.1-448s1c1,TGCTGGGATTACTGGACCTAT,pLKO.1,603,3UTR,77,85,,,Y,440355,LOC440355,CCGGTGCTGGGATTACTGGACCTATCTCGAGATAGGTCCAGTAATCCCAGCATTTTTG,AATTCAAAAATGCTGGGATTACTGGACCTATCTCGAGATAGGTCCAGTAATCCCAGCA,n/a
human,105375013,HCG20,NR_138037.1,TRCN0000086432,NM_027444.1-624s1c1,GCTACCAAGATACTAGCTGAT,pLKO.1,387,3UTR,77,85,,,Y,70508,Bbx,CCGGGCTACCAAGATACTAGCTGATCTCGAGATCAGCTAGTATCTTGGTAGCTTTTTG,AATTCAAAAAGCTACCAAGATACTAGCTGATCTCGAGATCAGCTAGTATCTTGGTAGC,n/a
