Taxon,"Gene ID","Gene Symbol",Transcript,"Clone ID","Legacy Clone Name","Target Seq",Vector,"Match Position","Match Region","Match %","SDR Match %","Intrinsic Score","Adjusted Score","Matches Other Gene in Same Taxon?","Orig. Target Gene ID","Orig. Target Gene Symbol","Forward Oligo Sequence","Reverse Oligo Sequence",Addgene
human,732265,COMMD4P2,NR_160652.1,TRCN0000143372,NM_017828.2-337s1c1,GCTGTTATGAGGAGAAGCAAA,pLKO.1,436,3UTR,100,100,4.95,2.475,Y,54939,COMMD4,CCGGGCTGTTATGAGGAGAAGCAAACTCGAGTTTGCTTCTCCTCATAACAGCTTTTTG,AATTCAAAAAGCTGTTATGAGGAGAAGCAAACTCGAGTTTGCTTCTCCTCATAACAGC,n/a
human,732265,COMMD4P2,NR_160652.1,TRCN0000140987,NM_017828.2-223s1c1,CAGTGCTGAGTTTCATCCTCT,pLKO.1,322,3UTR,100,100,2.64,1.32,Y,54939,COMMD4,CCGGCAGTGCTGAGTTTCATCCTCTCTCGAGAGAGGATGAAACTCAGCACTGTTTTTG,AATTCAAAAACAGTGCTGAGTTTCATCCTCTCTCGAGAGAGGATGAAACTCAGCACTG,n/a
human,732265,COMMD4P2,NR_160652.1,TRCN0000438076,NM_017828.3-108s21c1,AGAAATCAGCACGCTGGCCAA,pLKO_005,232,3UTR,95,95,,,Y,54939,COMMD4,CCGGAGAAATCAGCACGCTGGCCAACTCGAGTTGGCCAGCGTGCTGATTTCTTTTTTG,AATTCAAAAAAGAAATCAGCACGCTGGCCAACTCGAGTTGGCCAGCGTGCTGATTTCT,n/a
human,732265,COMMD4P2,NR_160652.1,TRCN0000117822,NM_001449.3-1927s1c1,GCAGTGCTGAAATTCATCCTA,pLKO.1,321,3UTR,85,89,,,Y,2273,FHL1,CCGGGCAGTGCTGAAATTCATCCTACTCGAGTAGGATGAATTTCAGCACTGCTTTTTG,AATTCAAAAAGCAGTGCTGAAATTCATCCTACTCGAGTAGGATGAATTTCAGCACTGC,n/a
human,732265,COMMD4P2,NR_160652.1,TRCN0000287067,NM_001449.4-2048s21c1,GCAGTGCTGAAATTCATCCTA,pLKO_005,321,3UTR,85,89,,,Y,2273,FHL1,CCGGGCAGTGCTGAAATTCATCCTACTCGAGTAGGATGAATTTCAGCACTGCTTTTTG,AATTCAAAAAGCAGTGCTGAAATTCATCCTACTCGAGTAGGATGAATTTCAGCACTGC,n/a
human,732265,COMMD4P2,NR_160652.1,TRCN0000187864,NM_146378.1-601s1c1,GCAGTGCTGACTTTCATCATT,pLKO.1,321,3UTR,85,89,,,Y,258375,Olfr794,CCGGGCAGTGCTGACTTTCATCATTCTCGAGAATGATGAAAGTCAGCACTGCTTTTTG,AATTCAAAAAGCAGTGCTGACTTTCATCATTCTCGAGAATGATGAAAGTCAGCACTGC,n/a
human,732265,COMMD4P2,NR_160652.1,TRCN0000184674,NM_025417.1-190s1c1,CTGCTGATGCCAAGTTTGAGT,pLKO.1,279,3UTR,80,89,,,Y,66199,Commd4,CCGGCTGCTGATGCCAAGTTTGAGTCTCGAGACTCAAACTTGGCATCAGCAGTTTTTG,AATTCAAAAACTGCTGATGCCAAGTTTGAGTCTCGAGACTCAAACTTGGCATCAGCAG,n/a
human,732265,COMMD4P2,NR_160652.1,TRCN0000184444,NM_013559.1-3227s1c1,GCTAGTGAACTGTAGCAGCAT,pLKO.1,381,3UTR,80,89,,,Y,15505,Hsph1,CCGGGCTAGTGAACTGTAGCAGCATCTCGAGATGCTGCTACAGTTCACTAGCTTTTTG,AATTCAAAAAGCTAGTGAACTGTAGCAGCATCTCGAGATGCTGCTACAGTTCACTAGC,n/a
human,732265,COMMD4P2,NR_160652.1,TRCN0000001614,NM_005465.x-1307s1c1,ACTGGCAAGATGTATATGATA,pLKO.1,244,3UTR,77,85,,,Y,10000,AKT3,CCGGACTGGCAAGATGTATATGATACTCGAGTATCATATACATCTTGCCAGTTTTTTG,AATTCAAAAAACTGGCAAGATGTATATGATACTCGAGTATCATATACATCTTGCCAGT,n/a
