Taxon,"Gene ID","Gene Symbol",Transcript,"Clone ID","Legacy Clone Name","Target Seq",Vector,"Match Position","Match Region","Match %","SDR Match %","Intrinsic Score","Adjusted Score","Matches Other Gene in Same Taxon?","Orig. Target Gene ID","Orig. Target Gene Symbol","Forward Oligo Sequence","Reverse Oligo Sequence",Addgene
human,101928053,LOC101928053,NR_120540.1,TRCN0000155836,NM_198582.1-3275s1c1,CCCAAAGTGCTGGGATTACAA,pLKO.1,362,3UTR,95,100,5.625,2.8125,Y,377007,KLHL30,CCGGCCCAAAGTGCTGGGATTACAACTCGAGTTGTAATCCCAGCACTTTGGGTTTTTG,AATTCAAAAACCCAAAGTGCTGGGATTACAACTCGAGTTGTAATCCCAGCACTTTGGG,n/a
human,101928053,LOC101928053,NR_120540.1,TRCN0000264189,NM_001085490.1-613s21c1,CAAGTAGCTGGGACTACAGGA,pLKO_005,1555,3UTR,95,100,2.64,1.32,Y,285501,LINC01098,CCGGCAAGTAGCTGGGACTACAGGACTCGAGTCCTGTAGTCCCAGCTACTTGTTTTTG,AATTCAAAAACAAGTAGCTGGGACTACAGGACTCGAGTCCTGTAGTCCCAGCTACTTG,n/a
human,101928053,LOC101928053,NR_120540.1,TRCN0000141025,NM_152361.1-835s1c1,CCCAAAGTGCTGGGATTACTT,pLKO.1,362,3UTR,90,100,5.625,2.8125,Y,126272,EID2B,CCGGCCCAAAGTGCTGGGATTACTTCTCGAGAAGTAATCCCAGCACTTTGGGTTTTTG,AATTCAAAAACCCAAAGTGCTGGGATTACTTCTCGAGAAGTAATCCCAGCACTTTGGG,n/a
human,101928053,LOC101928053,NR_120540.1,TRCN0000140610,NM_025042.2-931s1c1,GCCTCTCAGGTTCAAGCAATT,pLKO.1,1517,3UTR,95,95,,,Y,,,CCGGGCCTCTCAGGTTCAAGCAATTCTCGAGAATTGCTTGAACCTGAGAGGCTTTTTG,AATTCAAAAAGCCTCTCAGGTTCAAGCAATTCTCGAGAATTGCTTGAACCTGAGAGGC,n/a
human,101928053,LOC101928053,NR_120540.1,TRCN0000073773,NM_022164.1-1914s1c1,CCTCTCAAGTAGCTGGGACTA,pLKO.1,1550,3UTR,95,95,,,Y,64129,TINAGL1,CCGGCCTCTCAAGTAGCTGGGACTACTCGAGTAGTCCCAGCTACTTGAGAGGTTTTTG,AATTCAAAAACCTCTCAAGTAGCTGGGACTACTCGAGTAGTCCCAGCTACTTGAGAGG,n/a
human,101928053,LOC101928053,NR_120540.1,TRCN0000163440,NM_198476.1-1359s1c1,GAACTCCTGACCTTGAGTAAT,pLKO.1,1652,3UTR,90,89,,,Y,284325,C19orf54,CCGGGAACTCCTGACCTTGAGTAATCTCGAGATTACTCAAGGTCAGGAGTTCTTTTTG,AATTCAAAAAGAACTCCTGACCTTGAGTAATCTCGAGATTACTCAAGGTCAGGAGTTC,n/a
human,101928053,LOC101928053,NR_120540.1,TRCN0000011546,NM_153838.1-1882s1c1,GCTGTAAATCTGATTGTGGTT,pLKO.1,2068,3UTR,85,89,,,Y,221393,ADGRF4,CCGGGCTGTAAATCTGATTGTGGTTCTCGAGAACCACAATCAGATTTACAGCTTTTTG,AATTCAAAAAGCTGTAAATCTGATTGTGGTTCTCGAGAACCACAATCAGATTTACAGC,n/a
human,101928053,LOC101928053,NR_120540.1,TRCN0000236183,NM_020657.2-2340s21c1,CTTTAGCTGCATCTCTTAAAC,pLKO_005,1385,3UTR,85,89,,,Y,57343,ZNF304,CCGGCTTTAGCTGCATCTCTTAAACCTCGAGGTTTAAGAGATGCAGCTAAAGTTTTTG,AATTCAAAAACTTTAGCTGCATCTCTTAAACCTCGAGGTTTAAGAGATGCAGCTAAAG,n/a
human,101928053,LOC101928053,NR_120540.1,TRCN0000127912,NM_001004313.1-1598s1c1,CCCAAGAAGCTACGACTACAA,pLKO.1,239,3UTR,85,89,,,Y,388335,TMEM220,CCGGCCCAAGAAGCTACGACTACAACTCGAGTTGTAGTCGTAGCTTCTTGGGTTTTTG,AATTCAAAAACCCAAGAAGCTACGACTACAACTCGAGTTGTAGTCGTAGCTTCTTGGG,n/a
human,101928053,LOC101928053,NR_120540.1,TRCN0000166755,NM_198476.1-1358s1c1,CGAACTCCTGACCTTGAGTAA,pLKO.1,1651,3UTR,85,89,,,Y,284325,C19orf54,CCGGCGAACTCCTGACCTTGAGTAACTCGAGTTACTCAAGGTCAGGAGTTCGTTTTTG,AATTCAAAAACGAACTCCTGACCTTGAGTAACTCGAGTTACTCAAGGTCAGGAGTTCG,n/a
human,101928053,LOC101928053,NR_120540.1,TRCN0000091420,NM_007599.1-1245s1c1,TCCCATCTTCAAGCAATTCTT,pLKO.1,1520,3UTR,85,89,,,Y,12332,Capg,CCGGTCCCATCTTCAAGCAATTCTTCTCGAGAAGAATTGCTTGAAGATGGGATTTTTG,AATTCAAAAATCCCATCTTCAAGCAATTCTTCTCGAGAAGAATTGCTTGAAGATGGGA,n/a
human,101928053,LOC101928053,NR_120540.1,TRCN0000318310,NM_007599.3-1055s21c1,TCCCATCTTCAAGCAATTCTT,pLKO_005,1520,3UTR,85,89,,,Y,12332,Capg,CCGGTCCCATCTTCAAGCAATTCTTCTCGAGAAGAATTGCTTGAAGATGGGATTTTTG,AATTCAAAAATCCCATCTTCAAGCAATTCTTCTCGAGAAGAATTGCTTGAAGATGGGA,n/a
human,101928053,LOC101928053,NR_120540.1,TRCN0000221868,NM_005589.2-1195s1c2,CGAGTCTGTAATCTGATTGAT,pLKO.1,2064,3UTR,80,89,,,Y,4329,ALDH6A1,CCGGCGAGTCTGTAATCTGATTGATCTCGAGATCAATCAGATTACAGACTCGTTTTTG,AATTCAAAAACGAGTCTGTAATCTGATTGATCTCGAGATCAATCAGATTACAGACTCG,n/a
human,101928053,LOC101928053,NR_120540.1,TRCN0000028152,NM_007721.3-110s1c1,GCTCTGTTACAAGGCTGATGT,pLKO.1,148,3UTR,86,85,,,Y,12777,Ccr10,CCGGGCTCTGTTACAAGGCTGATGTCTCGAGACATCAGCCTTGTAACAGAGCTTTTTG,AATTCAAAAAGCTCTGTTACAAGGCTGATGTCTCGAGACATCAGCCTTGTAACAGAGC,n/a
human,101928053,LOC101928053,NR_120540.1,TRCN0000243854,NM_133791.4-4070s21c1,CTTCCGTTTCATACCAGTTTC,pLKO_005,1872,3UTR,81,85,,,Y,52357,Wwc2,CCGGCTTCCGTTTCATACCAGTTTCCTCGAGGAAACTGGTATGAAACGGAAGTTTTTG,AATTCAAAAACTTCCGTTTCATACCAGTTTCCTCGAGGAAACTGGTATGAAACGGAAG,n/a
human,101928053,LOC101928053,NR_120540.1,TRCN0000141498,NM_178126.2-309s1c1,CCTGACATCTCTTCGTCTTGT,pLKO.1,2282,3UTR,77,85,,,Y,162427,RETREG3,CCGGCCTGACATCTCTTCGTCTTGTCTCGAGACAAGACGAAGAGATGTCAGGTTTTTG,AATTCAAAAACCTGACATCTCTTCGTCTTGTCTCGAGACAAGACGAAGAGATGTCAGG,n/a
human,101928053,LOC101928053,NR_120540.1,TRCN0000280781,NM_178126.2-309s21c1,CCTGACATCTCTTCGTCTTGT,pLKO_005,2282,3UTR,77,85,,,Y,162427,RETREG3,CCGGCCTGACATCTCTTCGTCTTGTCTCGAGACAAGACGAAGAGATGTCAGGTTTTTG,AATTCAAAAACCTGACATCTCTTCGTCTTGTCTCGAGACAAGACGAAGAGATGTCAGG,n/a
human,101928053,LOC101928053,NR_120540.1,TRCN0000035026,NM_133443.1-1636s1c1,CCACATCAACTTCCTGGAGAA,pLKO.1,2207,3UTR,77,85,,,Y,84706,GPT2,CCGGCCACATCAACTTCCTGGAGAACTCGAGTTCTCCAGGAAGTTGATGTGGTTTTTG,AATTCAAAAACCACATCAACTTCCTGGAGAACTCGAGTTCTCCAGGAAGTTGATGTGG,n/a
human,101928053,LOC101928053,NR_120540.1,TRCN0000201554,NM_001002783.1-1580s1c1,CTTTCCTCAGATGGAAAGTCT,pLKO.1,1299,3UTR,77,85,,,Y,442822,9530085L02Rik,CCGGCTTTCCTCAGATGGAAAGTCTCTCGAGAGACTTTCCATCTGAGGAAAGTTTTTG,AATTCAAAAACTTTCCTCAGATGGAAAGTCTCTCGAGAGACTTTCCATCTGAGGAAAG,n/a
