Taxon,"Gene ID","Gene Symbol",Transcript,"Clone ID","Legacy Clone Name","Target Seq",Vector,"Match Position","Match Region","Match %","SDR Match %","Intrinsic Score","Adjusted Score","Matches Other Gene in Same Taxon?","Orig. Target Gene ID","Orig. Target Gene Symbol","Forward Oligo Sequence","Reverse Oligo Sequence",Addgene
human,725,C4BPB,XM_005273255.2,TRCN0000057154,NM_000716.2-360s1c1,CCAGTGGACAATAGCATATTT,pLKO.1,296,CDS,100,100,15,10.5,N,725,C4BPB,CCGGCCAGTGGACAATAGCATATTTCTCGAGAAATATGCTATTGTCCACTGGTTTTTG,AATTCAAAAACCAGTGGACAATAGCATATTTCTCGAGAAATATGCTATTGTCCACTGG,n/a
human,725,C4BPB,XM_005273255.2,TRCN0000057153,NM_000716.2-564s1c1,CCTGTGAATGTAAGTGACAAA,pLKO.1,500,CDS,100,100,4.95,3.465,N,725,C4BPB,CCGGCCTGTGAATGTAAGTGACAAACTCGAGTTTGTCACTTACATTCACAGGTTTTTG,AATTCAAAAACCTGTGAATGTAAGTGACAAACTCGAGTTTGTCACTTACATTCACAGG,n/a
human,725,C4BPB,XM_005273255.2,TRCN0000172742,NM_173580.1-340s1c1,GAGACAGAGTCTTGCTCTGTT,pLKO.1,682,CDS,100,100,.495,.2475,Y,283171,C11orf44,CCGGGAGACAGAGTCTTGCTCTGTTCTCGAGAACAGAGCAAGACTCTGTCTCTTTTTG,AATTCAAAAAGAGACAGAGTCTTGCTCTGTTCTCGAGAACAGAGCAAGACTCTGTCTC,n/a
human,725,C4BPB,XM_005273255.2,TRCN0000155836,NM_198582.1-3275s1c1,CCCAAAGTGCTGGGATTACAA,pLKO.1,919,3UTR,95,100,5.625,2.8125,Y,377007,KLHL30,CCGGCCCAAAGTGCTGGGATTACAACTCGAGTTGTAATCCCAGCACTTTGGGTTTTTG,AATTCAAAAACCCAAAGTGCTGGGATTACAACTCGAGTTGTAATCCCAGCACTTTGGG,n/a
human,725,C4BPB,XM_005273255.2,TRCN0000141025,NM_152361.1-835s1c1,CCCAAAGTGCTGGGATTACTT,pLKO.1,919,3UTR,90,100,5.625,2.8125,Y,126272,EID2B,CCGGCCCAAAGTGCTGGGATTACTTCTCGAGAAGTAATCCCAGCACTTTGGGTTTTTG,AATTCAAAAACCCAAAGTGCTGGGATTACTTCTCGAGAAGTAATCCCAGCACTTTGGG,n/a
human,725,C4BPB,XM_005273255.2,TRCN0000204533,NM_001013675.1-1987s1c1,CCTCCCAAAGTGCTGGAATTA,pLKO.1,916,3UTR,95,95,,,Y,400891,LRRC74B,CCGGCCTCCCAAAGTGCTGGAATTACTCGAGTAATTCCAGCACTTTGGGAGGTTTTTG,AATTCAAAAACCTCCCAAAGTGCTGGAATTACTCGAGTAATTCCAGCACTTTGGGAGG,n/a
human,725,C4BPB,XM_005273255.2,TRCN0000116737,NM_016369.3-2405s1c1,CCTCCCAAGTAGCTGGAATTA,pLKO.1,783,CDS,95,95,,,Y,51208,CLDN18,CCGGCCTCCCAAGTAGCTGGAATTACTCGAGTAATTCCAGCTACTTGGGAGGTTTTTG,AATTCAAAAACCTCCCAAGTAGCTGGAATTACTCGAGTAATTCCAGCTACTTGGGAGG,n/a
human,725,C4BPB,XM_005273255.2,TRCN0000072628,NM_016065.3-1636s1c1,CCTCCCAAAGTGCTAGGATTA,pLKO.1,916,3UTR,95,95,,,Y,51021,MRPS16,CCGGCCTCCCAAAGTGCTAGGATTACTCGAGTAATCCTAGCACTTTGGGAGGTTTTTG,AATTCAAAAACCTCCCAAAGTGCTAGGATTACTCGAGTAATCCTAGCACTTTGGGAGG,n/a
human,725,C4BPB,XM_005273255.2,TRCN0000165774,NM_001012391.1-946s1c1,CCTCCTAAGTAGCTGGGATTA,pLKO.1,783,CDS,95,95,,,Y,100652781,SNX29P1,CCGGCCTCCTAAGTAGCTGGGATTACTCGAGTAATCCCAGCTACTTAGGAGGTTTTTG,AATTCAAAAACCTCCTAAGTAGCTGGGATTACTCGAGTAATCCCAGCTACTTAGGAGG,n/a
human,725,C4BPB,XM_005273255.2,TRCN0000060503,NM_001001414.1-1521s1c1,CCTCTCAAGTAGCTGGGATTA,pLKO.1,783,CDS,95,95,,,Y,342897,NCCRP1,CCGGCCTCTCAAGTAGCTGGGATTACTCGAGTAATCCCAGCTACTTGAGAGGTTTTTG,AATTCAAAAACCTCTCAAGTAGCTGGGATTACTCGAGTAATCCCAGCTACTTGAGAGG,n/a
human,725,C4BPB,XM_005273255.2,TRCN0000155576,NM_198582.1-3137s1c1,CCTCTCAAGTAGCTGGGATTA,pLKO.1,783,CDS,95,95,,,Y,377007,KLHL30,CCGGCCTCTCAAGTAGCTGGGATTACTCGAGTAATCCCAGCTACTTGAGAGGTTTTTG,AATTCAAAAACCTCTCAAGTAGCTGGGATTACTCGAGTAATCCCAGCTACTTGAGAGG,n/a
human,725,C4BPB,XM_005273255.2,TRCN0000165697,NM_017842.1-943s1c1,CCTCTCAAGTAGCTGGGATTA,pLKO.1,783,CDS,95,95,,,Y,55652,SLC48A1,CCGGCCTCTCAAGTAGCTGGGATTACTCGAGTAATCCCAGCTACTTGAGAGGTTTTTG,AATTCAAAAACCTCTCAAGTAGCTGGGATTACTCGAGTAATCCCAGCTACTTGAGAGG,n/a
human,725,C4BPB,XM_005273255.2,TRCN0000138395,XM_374933.1-1847s1c1,CCTTCCAAGTAGCTGGGATTA,pLKO.1,783,CDS,95,95,,,Y,399949,C11orf88,CCGGCCTTCCAAGTAGCTGGGATTACTCGAGTAATCCCAGCTACTTGGAAGGTTTTTG,AATTCAAAAACCTTCCAAGTAGCTGGGATTACTCGAGTAATCCCAGCTACTTGGAAGG,n/a
human,725,C4BPB,XM_005273255.2,TRCN0000165534,NM_001012717.1-362s1c1,GAGACAGGGTTTCACCATGTT,pLKO.1,846,CDS,95,95,,,Y,,,CCGGGAGACAGGGTTTCACCATGTTCTCGAGAACATGGTGAAACCCTGTCTCTTTTTG,AATTCAAAAAGAGACAGGGTTTCACCATGTTCTCGAGAACATGGTGAAACCCTGTCTC,n/a
human,725,C4BPB,XM_005273255.2,TRCN0000164801,NM_016534.2-1646s1c1,CCTCCCAAAGTACTGGGATTA,pLKO.1,916,3UTR,95,95,,,Y,51275,MAPKAPK5-AS1,CCGGCCTCCCAAAGTACTGGGATTACTCGAGTAATCCCAGTACTTTGGGAGGTTTTTG,AATTCAAAAACCTCCCAAAGTACTGGGATTACTCGAGTAATCCCAGTACTTTGGGAGG,n/a
human,725,C4BPB,XM_005273255.2,TRCN0000008902,NM_016540.2-2291s1c1,CCTCCCAAAGTGTTGGGATTA,pLKO.1,916,3UTR,95,95,,,Y,10888,GPR83,CCGGCCTCCCAAAGTGTTGGGATTACTCGAGTAATCCCAACACTTTGGGAGGTTTTTG,AATTCAAAAACCTCCCAAAGTGTTGGGATTACTCGAGTAATCCCAACACTTTGGGAGG,n/a
human,725,C4BPB,XM_005273255.2,TRCN0000156315,NM_020702.1-3633s1c1,CCTCCCAAAGTGTTGGGATTA,pLKO.1,916,3UTR,95,95,,,Y,57462,MYORG,CCGGCCTCCCAAAGTGTTGGGATTACTCGAGTAATCCCAACACTTTGGGAGGTTTTTG,AATTCAAAAACCTCCCAAAGTGTTGGGATTACTCGAGTAATCCCAACACTTTGGGAGG,n/a
human,725,C4BPB,XM_005273255.2,TRCN0000116227,NM_024930.1-2895s1c1,CCTCCCAAAGTTCTGGGATTA,pLKO.1,916,3UTR,95,95,,,Y,79993,ELOVL7,CCGGCCTCCCAAAGTTCTGGGATTACTCGAGTAATCCCAGAACTTTGGGAGGTTTTTG,AATTCAAAAACCTCCCAAAGTTCTGGGATTACTCGAGTAATCCCAGAACTTTGGGAGG,n/a
human,725,C4BPB,XM_005273255.2,TRCN0000164591,NM_003281.3-2102s1c1,CCTCCCAAAGTTCTGGGATTA,pLKO.1,916,3UTR,95,95,,,Y,7135,TNNI1,CCGGCCTCCCAAAGTTCTGGGATTACTCGAGTAATCCCAGAACTTTGGGAGGTTTTTG,AATTCAAAAACCTCCCAAAGTTCTGGGATTACTCGAGTAATCCCAGAACTTTGGGAGG,n/a
human,725,C4BPB,XM_005273255.2,TRCN0000040213,NM_000618.2-6169s1c1,CCTCCCAAATTGCTGGGATTA,pLKO.1,916,3UTR,95,95,,,Y,3479,IGF1,CCGGCCTCCCAAATTGCTGGGATTACTCGAGTAATCCCAGCAATTTGGGAGGTTTTTG,AATTCAAAAACCTCCCAAATTGCTGGGATTACTCGAGTAATCCCAGCAATTTGGGAGG,n/a
human,725,C4BPB,XM_005273255.2,TRCN0000057398,NM_002261.1-793s1c1,CCTCCCAAGTTGCTGGGATTA,pLKO.1,783,CDS,95,95,,,Y,3823,KLRC3,CCGGCCTCCCAAGTTGCTGGGATTACTCGAGTAATCCCAGCAACTTGGGAGGTTTTTG,AATTCAAAAACCTCCCAAGTTGCTGGGATTACTCGAGTAATCCCAGCAACTTGGGAGG,n/a
human,725,C4BPB,XM_005273255.2,TRCN0000091448,NM_013513.1-2495s1c1,CCTCCCAAGTACTGGGATTAA,pLKO.1,783,CDS,90,95,,,Y,13828,Epb42,CCGGCCTCCCAAGTACTGGGATTAACTCGAGTTAATCCCAGTACTTGGGAGGTTTTTG,AATTCAAAAACCTCCCAAGTACTGGGATTAACTCGAGTTAATCCCAGTACTTGGGAGG,n/a
human,725,C4BPB,XM_005273255.2,TRCN0000162795,NM_017842.1-1079s1c1,CTTCCAAAGTGCTGGGATTAT,pLKO.1,917,3UTR,90,95,,,Y,55652,SLC48A1,CCGGCTTCCAAAGTGCTGGGATTATCTCGAGATAATCCCAGCACTTTGGAAGTTTTTG,AATTCAAAAACTTCCAAAGTGCTGGGATTATCTCGAGATAATCCCAGCACTTTGGAAG,n/a
human,725,C4BPB,XM_005273255.2,TRCN0000140657,NM_012099.1-2957s1c1,CCTCCCAAAGTGCTAGGATAA,pLKO.1,916,3UTR,90,95,,,Y,10849,CD3EAP,CCGGCCTCCCAAAGTGCTAGGATAACTCGAGTTATCCTAGCACTTTGGGAGGTTTTTG,AATTCAAAAACCTCCCAAAGTGCTAGGATAACTCGAGTTATCCTAGCACTTTGGGAGG,n/a
human,725,C4BPB,XM_005273255.2,TRCN0000264189,NM_001085490.1-613s21c1,CAAGTAGCTGGGACTACAGGA,pLKO_005,788,CDS,90,95,,,Y,285501,LINC01098,CCGGCAAGTAGCTGGGACTACAGGACTCGAGTCCTGTAGTCCCAGCTACTTGTTTTTG,AATTCAAAAACAAGTAGCTGGGACTACAGGACTCGAGTCCTGTAGTCCCAGCTACTTG,n/a
human,725,C4BPB,XM_005273255.2,TRCN0000047783,NM_017516.1-1624s1c1,GCCTCCAAAGTGCTGGAATTA,pLKO.1,915,3UTR,90,90,,,Y,54734,RAB39A,CCGGGCCTCCAAAGTGCTGGAATTACTCGAGTAATTCCAGCACTTTGGAGGCTTTTTG,AATTCAAAAAGCCTCCAAAGTGCTGGAATTACTCGAGTAATTCCAGCACTTTGGAGGC,n/a
human,725,C4BPB,XM_005273255.2,TRCN0000198922,NM_178897.2-2085s1c1,GCTTCCCAAATGCTGGGATTA,pLKO.1,915,3UTR,90,90,,,Y,100929,Tyw1,CCGGGCTTCCCAAATGCTGGGATTACTCGAGTAATCCCAGCATTTGGGAAGCTTTTTG,AATTCAAAAAGCTTCCCAAATGCTGGGATTACTCGAGTAATCCCAGCATTTGGGAAGC,n/a
human,725,C4BPB,XM_005273255.2,TRCN0000080193,NM_025867.1-1383s1c1,GCTGTGTTAGAAGATCCATTT,pLKO.1,134,5UTR,90,89,,,N,66957,Serpinb11,CCGGGCTGTGTTAGAAGATCCATTTCTCGAGAAATGGATCTTCTAACACAGCTTTTTG,AATTCAAAAAGCTGTGTTAGAAGATCCATTTCTCGAGAAATGGATCTTCTAACACAGC,n/a
human,725,C4BPB,XM_005273255.2,TRCN0000139587,NM_052966.1-4502s1c1,CGTCCCAAGTAGCTGGAATTA,pLKO.1,783,CDS,90,89,,,Y,116496,NIBAN1,CCGGCGTCCCAAGTAGCTGGAATTACTCGAGTAATTCCAGCTACTTGGGACGTTTTTG,AATTCAAAAACGTCCCAAGTAGCTGGAATTACTCGAGTAATTCCAGCTACTTGGGACG,n/a
human,725,C4BPB,XM_005273255.2,TRCN0000418415,NM_006748.3-366s21c1,GGGCTGGTGGAAAGCTATTTC,pLKO_005,1627,3UTR,90,89,,,Y,6503,SLA,CCGGGGGCTGGTGGAAAGCTATTTCCTCGAGGAAATAGCTTTCCACCAGCCCTTTTTG,AATTCAAAAAGGGCTGGTGGAAAGCTATTTCCTCGAGGAAATAGCTTTCCACCAGCCC,n/a
human,725,C4BPB,XM_005273255.2,TRCN0000121422,NM_172859.1-2893s1c1,CCTCCGAAGTAGCTGAGATTA,pLKO.1,783,CDS,90,89,,,Y,241688,Dzank1,CCGGCCTCCGAAGTAGCTGAGATTACTCGAGTAATCTCAGCTACTTCGGAGGTTTTTG,AATTCAAAAACCTCCGAAGTAGCTGAGATTACTCGAGTAATCTCAGCTACTTCGGAGG,n/a
human,725,C4BPB,XM_005273255.2,TRCN0000042823,NM_024055.2-973s1c1,CCTCACAAAGTGCTAGGATTA,pLKO.1,916,3UTR,90,89,,,Y,64924,SLC30A5,CCGGCCTCACAAAGTGCTAGGATTACTCGAGTAATCCTAGCACTTTGTGAGGTTTTTG,AATTCAAAAACCTCACAAAGTGCTAGGATTACTCGAGTAATCCTAGCACTTTGTGAGG,n/a
human,725,C4BPB,XM_005273255.2,TRCN0000082462,XM_371492.2-638s1c1,CCTCCCAAAGTGCCAGGATTA,pLKO.1,916,3UTR,90,89,,,Y,388949,LOC388949,CCGGCCTCCCAAAGTGCCAGGATTACTCGAGTAATCCTGGCACTTTGGGAGGTTTTTG,AATTCAAAAACCTCCCAAAGTGCCAGGATTACTCGAGTAATCCTGGCACTTTGGGAGG,n/a
human,725,C4BPB,XM_005273255.2,TRCN0000165736,NM_175901.3-1946s1c1,CCTCCCTAAGTGTTGGGATTA,pLKO.1,916,3UTR,90,89,,,Y,283932,FBXL19-AS1,CCGGCCTCCCTAAGTGTTGGGATTACTCGAGTAATCCCAACACTTAGGGAGGTTTTTG,AATTCAAAAACCTCCCTAAGTGTTGGGATTACTCGAGTAATCCCAACACTTAGGGAGG,n/a
human,725,C4BPB,XM_005273255.2,TRCN0000166560,NM_207497.1-412s1c1,CCTCCGAAAGTGCTAGGATTA,pLKO.1,916,3UTR,90,89,,,Y,401253,LINC00336,CCGGCCTCCGAAAGTGCTAGGATTACTCGAGTAATCCTAGCACTTTCGGAGGTTTTTG,AATTCAAAAACCTCCGAAAGTGCTAGGATTACTCGAGTAATCCTAGCACTTTCGGAGG,n/a
human,725,C4BPB,XM_005273255.2,TRCN0000164091,NM_024795.1-1273s1c1,CCTCCTAAAGTGCTGCGATTA,pLKO.1,916,3UTR,90,89,,,Y,79853,TM4SF20,CCGGCCTCCTAAAGTGCTGCGATTACTCGAGTAATCGCAGCACTTTAGGAGGTTTTTG,AATTCAAAAACCTCCTAAAGTGCTGCGATTACTCGAGTAATCGCAGCACTTTAGGAGG,n/a
human,725,C4BPB,XM_005273255.2,TRCN0000162985,NM_207497.1-342s1c1,GAGACAAGGTTTCACCATGTT,pLKO.1,846,CDS,90,89,,,Y,401253,LINC00336,CCGGGAGACAAGGTTTCACCATGTTCTCGAGAACATGGTGAAACCTTGTCTCTTTTTG,AATTCAAAAAGAGACAAGGTTTCACCATGTTCTCGAGAACATGGTGAAACCTTGTCTC,n/a
human,725,C4BPB,XM_005273255.2,TRCN0000140238,NM_024895.3-1807s1c1,GTCTCCCAAAGTGCTAGGATT,pLKO.1,915,3UTR,90,89,,,Y,79955,PDZD7,CCGGGTCTCCCAAAGTGCTAGGATTCTCGAGAATCCTAGCACTTTGGGAGACTTTTTG,AATTCAAAAAGTCTCCCAAAGTGCTAGGATTCTCGAGAATCCTAGCACTTTGGGAGAC,n/a
human,725,C4BPB,XM_005273255.2,TRCN0000073773,NM_022164.1-1914s1c1,CCTCTCAAGTAGCTGGGACTA,pLKO.1,783,CDS,90,89,,,Y,64129,TINAGL1,CCGGCCTCTCAAGTAGCTGGGACTACTCGAGTAGTCCCAGCTACTTGAGAGGTTTTTG,AATTCAAAAACCTCTCAAGTAGCTGGGACTACTCGAGTAGTCCCAGCTACTTGAGAGG,n/a
human,725,C4BPB,XM_005273255.2,TRCN0000129445,NM_145048.2-1500s1c1,GACTTCCAAAGTGCTGGGATT,pLKO.1,915,3UTR,90,89,,,Y,133015,PACRGL,CCGGGACTTCCAAAGTGCTGGGATTCTCGAGAATCCCAGCACTTTGGAAGTCTTTTTG,AATTCAAAAAGACTTCCAAAGTGCTGGGATTCTCGAGAATCCCAGCACTTTGGAAGTC,n/a
human,725,C4BPB,XM_005273255.2,TRCN0000140759,NM_018265.1-3067s1c1,GCCTTTCAAAGTGCTGGGATT,pLKO.1,915,3UTR,90,89,,,Y,55765,INAVA,CCGGGCCTTTCAAAGTGCTGGGATTCTCGAGAATCCCAGCACTTTGAAAGGCTTTTTG,AATTCAAAAAGCCTTTCAAAGTGCTGGGATTCTCGAGAATCCCAGCACTTTGAAAGGC,n/a
human,725,C4BPB,XM_005273255.2,TRCN0000155070,NM_017873.2-2761s1c1,GCCTTTCAAAGTGCTGGGATT,pLKO.1,915,3UTR,90,89,,,Y,140459,ASB6,CCGGGCCTTTCAAAGTGCTGGGATTCTCGAGAATCCCAGCACTTTGAAAGGCTTTTTG,AATTCAAAAAGCCTTTCAAAGTGCTGGGATTCTCGAGAATCCCAGCACTTTGAAAGGC,n/a
human,725,C4BPB,XM_005273255.2,TRCN0000165704,NM_152340.1-413s1c1,CAATGGCACAATCTTGGCTCA,pLKO.1,718,CDS,90,89,,,Y,652276,LOC652276,CCGGCAATGGCACAATCTTGGCTCACTCGAGTGAGCCAAGATTGTGCCATTGTTTTTG,AATTCAAAAACAATGGCACAATCTTGGCTCACTCGAGTGAGCCAAGATTGTGCCATTG,n/a
human,725,C4BPB,XM_005273255.2,TRCN0000163829,NM_173639.1-1102s1c1,CCTCCCAAATTACTGGGATTA,pLKO.1,916,3UTR,90,89,,,Y,284618,RUSC1-AS1,CCGGCCTCCCAAATTACTGGGATTACTCGAGTAATCCCAGTAATTTGGGAGGTTTTTG,AATTCAAAAACCTCCCAAATTACTGGGATTACTCGAGTAATCCCAGTAATTTGGGAGG,n/a
human,725,C4BPB,XM_005273255.2,TRCN0000140374,NM_025042.2-1098s1c1,GCTTCCCAAAGTACTGGGATT,pLKO.1,915,3UTR,90,89,,,Y,,,CCGGGCTTCCCAAAGTACTGGGATTCTCGAGAATCCCAGTACTTTGGGAAGCTTTTTG,AATTCAAAAAGCTTCCCAAAGTACTGGGATTCTCGAGAATCCCAGTACTTTGGGAAGC,n/a
human,725,C4BPB,XM_005273255.2,TRCN0000141040,NM_207361.2-5300s1c1,CCCTTTGACTTCTAGCCATAA,pLKO.1,1235,3UTR,85,89,,,Y,341640,FREM2,CCGGCCCTTTGACTTCTAGCCATAACTCGAGTTATGGCTAGAAGTCAAAGGGTTTTTG,AATTCAAAAACCCTTTGACTTCTAGCCATAACTCGAGTTATGGCTAGAAGTCAAAGGG,n/a
human,725,C4BPB,XM_005273255.2,TRCN0000220900,NM_152443.1-197s1c2,CTCCTTCTTCTCGTTCCTGTA,pLKO.1,1190,3UTR,85,89,,,Y,145226,RDH12,CCGGCTCCTTCTTCTCGTTCCTGTACTCGAGTACAGGAACGAGAAGAAGGAGTTTTTG,AATTCAAAAACTCCTTCTTCTCGTTCCTGTACTCGAGTACAGGAACGAGAAGAAGGAG,n/a
human,725,C4BPB,XM_005273255.2,TRCN0000148128,NM_178523.3-2713s1c1,GTGGAATTGTAATCTCCAGTA,pLKO.1,1025,3UTR,85,89,,,Y,90317,ZNF616,CCGGGTGGAATTGTAATCTCCAGTACTCGAGTACTGGAGATTACAATTCCACTTTTTG,AATTCAAAAAGTGGAATTGTAATCTCCAGTACTCGAGTACTGGAGATTACAATTCCAC,n/a
human,725,C4BPB,XM_005273255.2,TRCN0000183288,NM_182684.1-1337s1c1,GATCTGGTTGTTTAGAAGCAT,pLKO.1,1159,3UTR,85,89,,,Y,,,CCGGGATCTGGTTGTTTAGAAGCATCTCGAGATGCTTCTAAACAACCAGATCTTTTTG,AATTCAAAAAGATCTGGTTGTTTAGAAGCATCTCGAGATGCTTCTAAACAACCAGATC,n/a
human,725,C4BPB,XM_005273255.2,TRCN0000204623,NM_206816.1-643s1c1,GCCTTCTCCTATGGCCAAATA,pLKO.1,1500,3UTR,85,89,,,Y,383243,Olfr128,CCGGGCCTTCTCCTATGGCCAAATACTCGAGTATTTGGCCATAGGAGAAGGCTTTTTG,AATTCAAAAAGCCTTCTCCTATGGCCAAATACTCGAGTATTTGGCCATAGGAGAAGGC,n/a
human,725,C4BPB,XM_005273255.2,TRCN0000165833,NM_178514.3-1640s1c1,GCTCACTACAACCTCCACTTT,pLKO.1,734,CDS,85,89,,,Y,283487,LINC00346,CCGGGCTCACTACAACCTCCACTTTCTCGAGAAAGTGGAGGTTGTAGTGAGCTTTTTG,AATTCAAAAAGCTCACTACAACCTCCACTTTCTCGAGAAAGTGGAGGTTGTAGTGAGC,n/a
human,725,C4BPB,XM_005273255.2,TRCN0000129739,NM_152410.1-932s1c1,CTCTCAAGTAGCTGAGATTAT,pLKO.1,784,CDS,85,89,,,Y,135138,PACRG,CCGGCTCTCAAGTAGCTGAGATTATCTCGAGATAATCTCAGCTACTTGAGAGTTTTTG,AATTCAAAAACTCTCAAGTAGCTGAGATTATCTCGAGATAATCTCAGCTACTTGAGAG,n/a
human,725,C4BPB,XM_005273255.2,TRCN0000125337,NM_197979.1-110s1c1,CTGTTCTTTGAGCGAGCCTTC,pLKO.1,1797,3UTR,80,89,,,N,66152,Uqcr10,CCGGCTGTTCTTTGAGCGAGCCTTCCTCGAGGAAGGCTCGCTCAAAGAACAGTTTTTG,AATTCAAAAACTGTTCTTTGAGCGAGCCTTCCTCGAGGAAGGCTCGCTCAAAGAACAG,n/a
human,725,C4BPB,XM_005273255.2,TRCN0000075610,NM_007918.2-338s1c1,GTCACAATTTGAGATGGACAT,pLKO.1,1384,3UTR,80,89,,,Y,13685,Eif4ebp1,CCGGGTCACAATTTGAGATGGACATCTCGAGATGTCCATCTCAAATTGTGACTTTTTG,AATTCAAAAAGTCACAATTTGAGATGGACATCTCGAGATGTCCATCTCAAATTGTGAC,n/a
human,725,C4BPB,XM_005273255.2,TRCN0000335450,NM_007918.3-412s21c1,GTCACAATTTGAGATGGACAT,pLKO_005,1384,3UTR,80,89,,,Y,13685,Eif4ebp1,CCGGGTCACAATTTGAGATGGACATCTCGAGATGTCCATCTCAAATTGTGACTTTTTG,AATTCAAAAAGTCACAATTTGAGATGGACATCTCGAGATGTCCATCTCAAATTGTGAC,n/a
human,725,C4BPB,XM_005273255.2,TRCN0000156942,NM_032756.2-1232s1c1,GCAAGTTTCTGCTTCAGGTCT,pLKO.1,256,CDS,80,89,,,Y,84842,HPDL,CCGGGCAAGTTTCTGCTTCAGGTCTCTCGAGAGACCTGAAGCAGAAACTTGCTTTTTG,AATTCAAAAAGCAAGTTTCTGCTTCAGGTCTCTCGAGAGACCTGAAGCAGAAACTTGC,n/a
human,725,C4BPB,XM_005273255.2,TRCN0000188855,XM_064884.1-458s1c1,GCTTCATCTCACTCACTCACA,pLKO.1,1466,3UTR,80,89,,,Y,125963,OR1M1,CCGGGCTTCATCTCACTCACTCACACTCGAGTGTGAGTGAGTGAGATGAAGCTTTTTG,AATTCAAAAAGCTTCATCTCACTCACTCACACTCGAGTGTGAGTGAGTGAGATGAAGC,n/a
human,725,C4BPB,XM_005273255.2,TRCN0000447354,NM_138296.2-296s21c1,ATGCCTTCACCTATGGCCCTT,pLKO_005,1498,3UTR,80,89,,,Y,171558,PTCRA,CCGGATGCCTTCACCTATGGCCCTTCTCGAGAAGGGCCATAGGTGAAGGCATTTTTTG,AATTCAAAAAATGCCTTCACCTATGGCCCTTCTCGAGAAGGGCCATAGGTGAAGGCAT,n/a
human,725,C4BPB,XM_005273255.2,TRCN0000005562,NM_017547.2-398s1c1,GCAGTTCTCATTGCCTGAGAA,pLKO.1,765,CDS,80,89,,,Y,55572,FOXRED1,CCGGGCAGTTCTCATTGCCTGAGAACTCGAGTTCTCAGGCAATGAGAACTGCTTTTTG,AATTCAAAAAGCAGTTCTCATTGCCTGAGAACTCGAGTTCTCAGGCAATGAGAACTGC,n/a
human,725,C4BPB,XM_005273255.2,TRCN0000335917,NM_017547.2-398s21c1,GCAGTTCTCATTGCCTGAGAA,pLKO_005,765,CDS,80,89,,,Y,55572,FOXRED1,CCGGGCAGTTCTCATTGCCTGAGAACTCGAGTTCTCAGGCAATGAGAACTGCTTTTTG,AATTCAAAAAGCAGTTCTCATTGCCTGAGAACTCGAGTTCTCAGGCAATGAGAACTGC,n/a
human,725,C4BPB,XM_005273255.2,TRCN0000430090,NM_028031.3-1547s21c1,TGGTATGTGACTGGATCATAT,pLKO_005,1063,3UTR,80,89,,,Y,243983,Zdhhc13,CCGGTGGTATGTGACTGGATCATATCTCGAGATATGATCCAGTCACATACCATTTTTG,AATTCAAAAATGGTATGTGACTGGATCATATCTCGAGATATGATCCAGTCACATACCA,n/a
human,725,C4BPB,XM_005273255.2,TRCN0000339634,NM_025505.4-1445s21c1,TTCCATCCCTATACCAGATAT,pLKO_005,3,5UTR,80,89,,,Y,66352,Blzf1,CCGGTTCCATCCCTATACCAGATATCTCGAGATATCTGGTATAGGGATGGAATTTTTG,AATTCAAAAATTCCATCCCTATACCAGATATCTCGAGATATCTGGTATAGGGATGGAA,n/a
human,725,C4BPB,XM_005273255.2,TRCN0000168807,NM_178520.2-2253s1c1,GCTGATCTCAAACTCCTGATA,pLKO.1,873,CDS,80,89,,,Y,284186,TMEM105,CCGGGCTGATCTCAAACTCCTGATACTCGAGTATCAGGAGTTTGAGATCAGCTTTTTG,AATTCAAAAAGCTGATCTCAAACTCCTGATACTCGAGTATCAGGAGTTTGAGATCAGC,n/a
human,725,C4BPB,XM_005273255.2,TRCN0000192662,NM_175017.2-370s1c1,GAGGAAACGATGAAGAACAAA,pLKO.1,1674,3UTR,77,85,,,Y,232217,4933427D06Rik,CCGGGAGGAAACGATGAAGAACAAACTCGAGTTTGTTCTTCATCGTTTCCTCTTTTTG,AATTCAAAAAGAGGAAACGATGAAGAACAAACTCGAGTTTGTTCTTCATCGTTTCCTC,n/a
