Taxon,"Gene ID","Gene Symbol",Transcript,"Clone ID","Legacy Clone Name","Target Seq",Vector,"Match Position","Match Region","Match %","SDR Match %","Intrinsic Score","Adjusted Score","Matches Other Gene in Same Taxon?","Orig. Target Gene ID","Orig. Target Gene Symbol","Forward Oligo Sequence","Reverse Oligo Sequence",Addgene
mouse,79464,Lias,XM_006504195.2,TRCN0000076300,NM_024471.2-198s1c1,TCACGGTTAGAGCATTAAGTT,pLKO.1,172,CDS,100,100,5.625,4.5,N,79464,Lias,CCGGTCACGGTTAGAGCATTAAGTTCTCGAGAACTTAATGCTCTAACCGTGATTTTTG,AATTCAAAAATCACGGTTAGAGCATTAAGTTCTCGAGAACTTAATGCTCTAACCGTGA,n/a
mouse,79464,Lias,XM_006504195.2,TRCN0000076299,NM_024471.2-201s1c1,CGGTTAGAGCATTAAGTTCTT,pLKO.1,175,CDS,100,100,4.95,3.96,N,79464,Lias,CCGGCGGTTAGAGCATTAAGTTCTTCTCGAGAAGAACTTAATGCTCTAACCGTTTTTG,AATTCAAAAACGGTTAGAGCATTAAGTTCTTCTCGAGAAGAACTTAATGCTCTAACCG,n/a
mouse,79464,Lias,XM_006504195.2,TRCN0000318298,NM_024471.4-200s21c1,CGGTTAGAGCATTAAGTTCTT,pLKO_005,175,CDS,100,100,4.95,3.96,N,79464,Lias,CCGGCGGTTAGAGCATTAAGTTCTTCTCGAGAAGAACTTAATGCTCTAACCGTTTTTG,AATTCAAAAACGGTTAGAGCATTAAGTTCTTCTCGAGAAGAACTTAATGCTCTAACCG,n/a
mouse,79464,Lias,XM_006504195.2,TRCN0000083516,NM_007035.2-826s1c1,CCTTCAAGAATTTGGTATCTT,pLKO.1,236,CDS,85,89,,,N,11081,KERA,CCGGCCTTCAAGAATTTGGTATCTTCTCGAGAAGATACCAAATTCTTGAAGGTTTTTG,AATTCAAAAACCTTCAAGAATTTGGTATCTTCTCGAGAAGATACCAAATTCTTGAAGG,n/a
mouse,79464,Lias,XM_006504195.2,TRCN0000229750,NM_006859.2-115s21c1,CCGGGTATTTGGGAGATATTT,pLKO_005,149,CDS,80,89,,,N,11019,LIAS,CCGGCCGGGTATTTGGGAGATATTTCTCGAGAAATATCTCCCAAATACCCGGTTTTTG,AATTCAAAAACCGGGTATTTGGGAGATATTTCTCGAGAAATATCTCCCAAATACCCGG,n/a
mouse,79464,Lias,XM_006504195.2,TRCN0000263613,NM_178837.3-107s21c1,CCGGGATATTTGGAGGATAAA,pLKO_005,148,CDS,80,89,,,N,352909,DNAAF3,CCGGCCGGGATATTTGGAGGATAAACTCGAGTTTATCCTCCAAATATCCCGGTTTTTG,AATTCAAAAACCGGGATATTTGGAGGATAAACTCGAGTTTATCCTCCAAATATCCCGG,n/a
mouse,79464,Lias,XM_006504195.2,TRCN0000149988,NM_032042.3-3921s1c1,CGAAACTTAAAGGCCAGATTA,pLKO.1,294,CDS,77,85,,,N,83989,FAM172A,CCGGCGAAACTTAAAGGCCAGATTACTCGAGTAATCTGGCCTTTAAGTTTCGTTTTTG,AATTCAAAAACGAAACTTAAAGGCCAGATTACTCGAGTAATCTGGCCTTTAAGTTTCG,n/a
mouse,79464,Lias,XM_006504195.2,TRCN0000197477,NM_138603.2-1136s1c1,CACAACATTGAAGAGGTTGAA,pLKO.1,344,CDS,77,85,,,Y,54638,Ccdc22,CCGGCACAACATTGAAGAGGTTGAACTCGAGTTCAACCTCTTCAATGTTGTGTTTTTG,AATTCAAAAACACAACATTGAAGAGGTTGAACTCGAGTTCAACCTCTTCAATGTTGTG,n/a
