Taxon,"Gene ID","Gene Symbol",Transcript,"Clone ID","Legacy Clone Name","Target Seq",Vector,"Match Position","Match Region","Match %","SDR Match %","Intrinsic Score","Adjusted Score","Matches Other Gene in Same Taxon?","Orig. Target Gene ID","Orig. Target Gene Symbol","Forward Oligo Sequence","Reverse Oligo Sequence",Addgene
human,9941,EXOG,XM_005265635.3,TRCN0000049857,NM_005107.1-620s1c1,CTTTGACCTTACCTCAGACTA,pLKO.1,638,CDS,100,100,4.95,6.93,N,9941,EXOG,CCGGCTTTGACCTTACCTCAGACTACTCGAGTAGTCTGAGGTAAGGTCAAAGTTTTTG,AATTCAAAAACTTTGACCTTACCTCAGACTACTCGAGTAGTCTGAGGTAAGGTCAAAG,n/a
human,9941,EXOG,XM_005265635.3,TRCN0000049854,NM_005107.1-403s1c1,GCCTTCAATGAAGATTATGTT,pLKO.1,421,CDS,100,100,5.625,4.5,N,9941,EXOG,CCGGGCCTTCAATGAAGATTATGTTCTCGAGAACATAATCTTCATTGAAGGCTTTTTG,AATTCAAAAAGCCTTCAATGAAGATTATGTTCTCGAGAACATAATCTTCATTGAAGGC,n/a
human,9941,EXOG,XM_005265635.3,TRCN0000431790,NM_005107.3-371s21c1,GATGGGTTCTTGAACATATTT,pLKO_005,320,CDS,100,100,15,10.5,N,9941,EXOG,CCGGGATGGGTTCTTGAACATATTTCTCGAGAAATATGTTCAAGAACCCATCTTTTTG,AATTCAAAAAGATGGGTTCTTGAACATATTTCTCGAGAAATATGTTCAAGAACCCATC,n/a
human,9941,EXOG,XM_005265635.3,TRCN0000431664,NM_005107.3-436s21c1,TTTAAGCCTGATCCCAATATC,pLKO_005,385,CDS,100,100,13.2,9.24,N,9941,EXOG,CCGGTTTAAGCCTGATCCCAATATCCTCGAGGATATTGGGATCAGGCTTAAATTTTTG,AATTCAAAAATTTAAGCCTGATCCCAATATCCTCGAGGATATTGGGATCAGGCTTAAA,n/a
human,9941,EXOG,XM_005265635.3,TRCN0000425108,NM_005107.3-616s21c1,TATTGGAACAGAATAGAAATG,pLKO_005,565,CDS,100,100,10.8,7.56,N,9941,EXOG,CCGGTATTGGAACAGAATAGAAATGCTCGAGCATTTCTATTCTGTTCCAATATTTTTG,AATTCAAAAATATTGGAACAGAATAGAAATGCTCGAGCATTTCTATTCTGTTCCAATA,n/a
human,9941,EXOG,XM_005265635.3,TRCN0000165027,NM_001013636.1-513s1c1,GAACTCCTGACCTCAAGTGAT,pLKO.1,1106,3UTR,100,100,4.95,2.475,Y,387873,LOC387873,CCGGGAACTCCTGACCTCAAGTGATCTCGAGATCACTTGAGGTCAGGAGTTCTTTTTG,AATTCAAAAAGAACTCCTGACCTCAAGTGATCTCGAGATCACTTGAGGTCAGGAGTTC,n/a
human,9941,EXOG,XM_005265635.3,TRCN0000155836,NM_198582.1-3275s1c1,CCCAAAGTGCTGGGATTACAA,pLKO.1,1143,3UTR,95,100,5.625,2.8125,Y,377007,KLHL30,CCGGCCCAAAGTGCTGGGATTACAACTCGAGTTGTAATCCCAGCACTTTGGGTTTTTG,AATTCAAAAACCCAAAGTGCTGGGATTACAACTCGAGTTGTAATCCCAGCACTTTGGG,n/a
human,9941,EXOG,XM_005265635.3,TRCN0000141025,NM_152361.1-835s1c1,CCCAAAGTGCTGGGATTACTT,pLKO.1,1143,3UTR,90,100,5.625,2.8125,Y,126272,EID2B,CCGGCCCAAAGTGCTGGGATTACTTCTCGAGAAGTAATCCCAGCACTTTGGGTTTTTG,AATTCAAAAACCCAAAGTGCTGGGATTACTTCTCGAGAAGTAATCCCAGCACTTTGGG,n/a
human,9941,EXOG,XM_005265635.3,TRCN0000116737,NM_016369.3-2405s1c1,CCTCCCAAGTAGCTGGAATTA,pLKO.1,1001,3UTR,95,95,,,Y,51208,CLDN18,CCGGCCTCCCAAGTAGCTGGAATTACTCGAGTAATTCCAGCTACTTGGGAGGTTTTTG,AATTCAAAAACCTCCCAAGTAGCTGGAATTACTCGAGTAATTCCAGCTACTTGGGAGG,n/a
human,9941,EXOG,XM_005265635.3,TRCN0000165774,NM_001012391.1-946s1c1,CCTCCTAAGTAGCTGGGATTA,pLKO.1,1001,3UTR,95,95,,,Y,100652781,SNX29P1,CCGGCCTCCTAAGTAGCTGGGATTACTCGAGTAATCCCAGCTACTTAGGAGGTTTTTG,AATTCAAAAACCTCCTAAGTAGCTGGGATTACTCGAGTAATCCCAGCTACTTAGGAGG,n/a
human,9941,EXOG,XM_005265635.3,TRCN0000060503,NM_001001414.1-1521s1c1,CCTCTCAAGTAGCTGGGATTA,pLKO.1,1001,3UTR,95,95,,,Y,342897,NCCRP1,CCGGCCTCTCAAGTAGCTGGGATTACTCGAGTAATCCCAGCTACTTGAGAGGTTTTTG,AATTCAAAAACCTCTCAAGTAGCTGGGATTACTCGAGTAATCCCAGCTACTTGAGAGG,n/a
human,9941,EXOG,XM_005265635.3,TRCN0000155576,NM_198582.1-3137s1c1,CCTCTCAAGTAGCTGGGATTA,pLKO.1,1001,3UTR,95,95,,,Y,377007,KLHL30,CCGGCCTCTCAAGTAGCTGGGATTACTCGAGTAATCCCAGCTACTTGAGAGGTTTTTG,AATTCAAAAACCTCTCAAGTAGCTGGGATTACTCGAGTAATCCCAGCTACTTGAGAGG,n/a
human,9941,EXOG,XM_005265635.3,TRCN0000165697,NM_017842.1-943s1c1,CCTCTCAAGTAGCTGGGATTA,pLKO.1,1001,3UTR,95,95,,,Y,55652,SLC48A1,CCGGCCTCTCAAGTAGCTGGGATTACTCGAGTAATCCCAGCTACTTGAGAGGTTTTTG,AATTCAAAAACCTCTCAAGTAGCTGGGATTACTCGAGTAATCCCAGCTACTTGAGAGG,n/a
human,9941,EXOG,XM_005265635.3,TRCN0000138395,XM_374933.1-1847s1c1,CCTTCCAAGTAGCTGGGATTA,pLKO.1,1001,3UTR,95,95,,,Y,399949,C11orf88,CCGGCCTTCCAAGTAGCTGGGATTACTCGAGTAATCCCAGCTACTTGGAAGGTTTTTG,AATTCAAAAACCTTCCAAGTAGCTGGGATTACTCGAGTAATCCCAGCTACTTGGAAGG,n/a
human,9941,EXOG,XM_005265635.3,TRCN0000155187,NM_001003795.1-3305s1c1,GAGATGAGGTTTCACCATGTT,pLKO.1,1070,3UTR,95,95,,,Y,389524,GTF2IRD2B,CCGGGAGATGAGGTTTCACCATGTTCTCGAGAACATGGTGAAACCTCATCTCTTTTTG,AATTCAAAAAGAGATGAGGTTTCACCATGTTCTCGAGAACATGGTGAAACCTCATCTC,n/a
human,9941,EXOG,XM_005265635.3,TRCN0000168774,NM_001013670.1-1394s1c1,GAGATGGAGTTTCACCATGTT,pLKO.1,1070,3UTR,95,95,,,Y,400464,LOC400464,CCGGGAGATGGAGTTTCACCATGTTCTCGAGAACATGGTGAAACTCCATCTCTTTTTG,AATTCAAAAAGAGATGGAGTTTCACCATGTTCTCGAGAACATGGTGAAACTCCATCTC,n/a
human,9941,EXOG,XM_005265635.3,TRCN0000057398,NM_002261.1-793s1c1,CCTCCCAAGTTGCTGGGATTA,pLKO.1,1001,3UTR,95,95,,,Y,3823,KLRC3,CCGGCCTCCCAAGTTGCTGGGATTACTCGAGTAATCCCAGCAACTTGGGAGGTTTTTG,AATTCAAAAACCTCCCAAGTTGCTGGGATTACTCGAGTAATCCCAGCAACTTGGGAGG,n/a
human,9941,EXOG,XM_005265635.3,TRCN0000091448,NM_013513.1-2495s1c1,CCTCCCAAGTACTGGGATTAA,pLKO.1,1001,3UTR,90,95,,,Y,13828,Epb42,CCGGCCTCCCAAGTACTGGGATTAACTCGAGTTAATCCCAGTACTTGGGAGGTTTTTG,AATTCAAAAACCTCCCAAGTACTGGGATTAACTCGAGTTAATCCCAGTACTTGGGAGG,n/a
human,9941,EXOG,XM_005265635.3,TRCN0000148469,NM_152459.2-1181s1c1,CTGGGTTCAAGCAATTCTCTT,pLKO.1,973,3UTR,90,95,,,Y,146556,C16orf89,CCGGCTGGGTTCAAGCAATTCTCTTCTCGAGAAGAGAATTGCTTGAACCCAGTTTTTG,AATTCAAAAACTGGGTTCAAGCAATTCTCTTCTCGAGAAGAGAATTGCTTGAACCCAG,n/a
human,9941,EXOG,XM_005265635.3,TRCN0000264189,NM_001085490.1-613s21c1,CAAGTAGCTGGGACTACAGGA,pLKO_005,1006,3UTR,90,95,,,Y,285501,LINC01098,CCGGCAAGTAGCTGGGACTACAGGACTCGAGTCCTGTAGTCCCAGCTACTTGTTTTTG,AATTCAAAAACAAGTAGCTGGGACTACAGGACTCGAGTCCTGTAGTCCCAGCTACTTG,n/a
human,9941,EXOG,XM_005265635.3,TRCN0000164801,NM_016534.2-1646s1c1,CCTCCCAAAGTACTGGGATTA,pLKO.1,1001,3UTR,90,90,,,Y,51275,MAPKAPK5-AS1,CCGGCCTCCCAAAGTACTGGGATTACTCGAGTAATCCCAGTACTTTGGGAGGTTTTTG,AATTCAAAAACCTCCCAAAGTACTGGGATTACTCGAGTAATCCCAGTACTTTGGGAGG,n/a
human,9941,EXOG,XM_005265635.3,TRCN0000198922,NM_178897.2-2085s1c1,GCTTCCCAAATGCTGGGATTA,pLKO.1,1139,3UTR,90,90,,,Y,100929,Tyw1,CCGGGCTTCCCAAATGCTGGGATTACTCGAGTAATCCCAGCATTTGGGAAGCTTTTTG,AATTCAAAAAGCTTCCCAAATGCTGGGATTACTCGAGTAATCCCAGCATTTGGGAAGC,n/a
human,9941,EXOG,XM_005265635.3,TRCN0000072463,NM_001001563.1-2222s1c1,GCTACCATACCCAGCTAATTT,pLKO.1,1031,3UTR,90,89,,,Y,92609,TIMM50,CCGGGCTACCATACCCAGCTAATTTCTCGAGAAATTAGCTGGGTATGGTAGCTTTTTG,AATTCAAAAAGCTACCATACCCAGCTAATTTCTCGAGAAATTAGCTGGGTATGGTAGC,n/a
human,9941,EXOG,XM_005265635.3,TRCN0000139587,NM_052966.1-4502s1c1,CGTCCCAAGTAGCTGGAATTA,pLKO.1,1001,3UTR,90,89,,,Y,116496,NIBAN1,CCGGCGTCCCAAGTAGCTGGAATTACTCGAGTAATTCCAGCTACTTGGGACGTTTTTG,AATTCAAAAACGTCCCAAGTAGCTGGAATTACTCGAGTAATTCCAGCTACTTGGGACG,n/a
human,9941,EXOG,XM_005265635.3,TRCN0000204533,NM_001013675.1-1987s1c1,CCTCCCAAAGTGCTGGAATTA,pLKO.1,1140,3UTR,90,89,,,Y,400891,LRRC74B,CCGGCCTCCCAAAGTGCTGGAATTACTCGAGTAATTCCAGCACTTTGGGAGGTTTTTG,AATTCAAAAACCTCCCAAAGTGCTGGAATTACTCGAGTAATTCCAGCACTTTGGGAGG,n/a
human,9941,EXOG,XM_005265635.3,TRCN0000121422,NM_172859.1-2893s1c1,CCTCCGAAGTAGCTGAGATTA,pLKO.1,1001,3UTR,90,89,,,Y,241688,Dzank1,CCGGCCTCCGAAGTAGCTGAGATTACTCGAGTAATCTCAGCTACTTCGGAGGTTTTTG,AATTCAAAAACCTCCGAAGTAGCTGAGATTACTCGAGTAATCTCAGCTACTTCGGAGG,n/a
human,9941,EXOG,XM_005265635.3,TRCN0000063698,NM_006989.3-4525s1c1,GCCCAGCTAATTCTTGTATTT,pLKO.1,1039,3UTR,90,89,,,Y,10156,RASA4,CCGGGCCCAGCTAATTCTTGTATTTCTCGAGAAATACAAGAATTAGCTGGGCTTTTTG,AATTCAAAAAGCCCAGCTAATTCTTGTATTTCTCGAGAAATACAAGAATTAGCTGGGC,n/a
human,9941,EXOG,XM_005265635.3,TRCN0000150276,NM_144718.2-3773s1c1,GCCCAGCTAATTTGTGTATTT,pLKO.1,1039,3UTR,90,89,,,Y,152185,SPICE1,CCGGGCCCAGCTAATTTGTGTATTTCTCGAGAAATACACAAATTAGCTGGGCTTTTTG,AATTCAAAAAGCCCAGCTAATTTGTGTATTTCTCGAGAAATACACAAATTAGCTGGGC,n/a
human,9941,EXOG,XM_005265635.3,TRCN0000072628,NM_016065.3-1636s1c1,CCTCCCAAAGTGCTAGGATTA,pLKO.1,1140,3UTR,90,89,,,Y,51021,MRPS16,CCGGCCTCCCAAAGTGCTAGGATTACTCGAGTAATCCTAGCACTTTGGGAGGTTTTTG,AATTCAAAAACCTCCCAAAGTGCTAGGATTACTCGAGTAATCCTAGCACTTTGGGAGG,n/a
human,9941,EXOG,XM_005265635.3,TRCN0000172710,NM_032937.2-575s1c1,GAACTCCTGACCTCAAGCAAT,pLKO.1,1106,3UTR,90,89,,,Y,85026,ARRDC1-AS1,CCGGGAACTCCTGACCTCAAGCAATCTCGAGATTGCTTGAGGTCAGGAGTTCTTTTTG,AATTCAAAAAGAACTCCTGACCTCAAGCAATCTCGAGATTGCTTGAGGTCAGGAGTTC,n/a
human,9941,EXOG,XM_005265635.3,TRCN0000165534,NM_001012717.1-362s1c1,GAGACAGGGTTTCACCATGTT,pLKO.1,1070,3UTR,90,89,,,Y,,,CCGGGAGACAGGGTTTCACCATGTTCTCGAGAACATGGTGAAACCCTGTCTCTTTTTG,AATTCAAAAAGAGACAGGGTTTCACCATGTTCTCGAGAACATGGTGAAACCCTGTCTC,n/a
human,9941,EXOG,XM_005265635.3,TRCN0000165050,NM_173795.2-1753s1c1,GCTGGAGTGTAATGGTGCAAT,pLKO.1,927,3UTR,90,89,,,Y,388591,RNF207,CCGGGCTGGAGTGTAATGGTGCAATCTCGAGATTGCACCATTACACTCCAGCTTTTTG,AATTCAAAAAGCTGGAGTGTAATGGTGCAATCTCGAGATTGCACCATTACACTCCAGC,n/a
human,9941,EXOG,XM_005265635.3,TRCN0000073773,NM_022164.1-1914s1c1,CCTCTCAAGTAGCTGGGACTA,pLKO.1,1001,3UTR,90,89,,,Y,64129,TINAGL1,CCGGCCTCTCAAGTAGCTGGGACTACTCGAGTAGTCCCAGCTACTTGAGAGGTTTTTG,AATTCAAAAACCTCTCAAGTAGCTGGGACTACTCGAGTAGTCCCAGCTACTTGAGAGG,n/a
human,9941,EXOG,XM_005265635.3,TRCN0000008902,NM_016540.2-2291s1c1,CCTCCCAAAGTGTTGGGATTA,pLKO.1,1140,3UTR,90,89,,,Y,10888,GPR83,CCGGCCTCCCAAAGTGTTGGGATTACTCGAGTAATCCCAACACTTTGGGAGGTTTTTG,AATTCAAAAACCTCCCAAAGTGTTGGGATTACTCGAGTAATCCCAACACTTTGGGAGG,n/a
human,9941,EXOG,XM_005265635.3,TRCN0000156315,NM_020702.1-3633s1c1,CCTCCCAAAGTGTTGGGATTA,pLKO.1,1140,3UTR,90,89,,,Y,57462,MYORG,CCGGCCTCCCAAAGTGTTGGGATTACTCGAGTAATCCCAACACTTTGGGAGGTTTTTG,AATTCAAAAACCTCCCAAAGTGTTGGGATTACTCGAGTAATCCCAACACTTTGGGAGG,n/a
human,9941,EXOG,XM_005265635.3,TRCN0000116227,NM_024930.1-2895s1c1,CCTCCCAAAGTTCTGGGATTA,pLKO.1,1140,3UTR,90,89,,,Y,79993,ELOVL7,CCGGCCTCCCAAAGTTCTGGGATTACTCGAGTAATCCCAGAACTTTGGGAGGTTTTTG,AATTCAAAAACCTCCCAAAGTTCTGGGATTACTCGAGTAATCCCAGAACTTTGGGAGG,n/a
human,9941,EXOG,XM_005265635.3,TRCN0000164591,NM_003281.3-2102s1c1,CCTCCCAAAGTTCTGGGATTA,pLKO.1,1140,3UTR,90,89,,,Y,7135,TNNI1,CCGGCCTCCCAAAGTTCTGGGATTACTCGAGTAATCCCAGAACTTTGGGAGGTTTTTG,AATTCAAAAACCTCCCAAAGTTCTGGGATTACTCGAGTAATCCCAGAACTTTGGGAGG,n/a
human,9941,EXOG,XM_005265635.3,TRCN0000040213,NM_000618.2-6169s1c1,CCTCCCAAATTGCTGGGATTA,pLKO.1,1001,3UTR,90,89,,,Y,3479,IGF1,CCGGCCTCCCAAATTGCTGGGATTACTCGAGTAATCCCAGCAATTTGGGAGGTTTTTG,AATTCAAAAACCTCCCAAATTGCTGGGATTACTCGAGTAATCCCAGCAATTTGGGAGG,n/a
human,9941,EXOG,XM_005265635.3,TRCN0000140374,NM_025042.2-1098s1c1,GCTTCCCAAAGTACTGGGATT,pLKO.1,1139,3UTR,90,89,,,Y,,,CCGGGCTTCCCAAAGTACTGGGATTCTCGAGAATCCCAGTACTTTGGGAAGCTTTTTG,AATTCAAAAAGCTTCCCAAAGTACTGGGATTCTCGAGAATCCCAGTACTTTGGGAAGC,n/a
human,9941,EXOG,XM_005265635.3,TRCN0000378532,NM_020386.3-545s21c1,ATGGCATTCCTGCGTCCTTTA,pLKO_005,812,3UTR,85,89,,,Y,57110,PLAAT1,CCGGATGGCATTCCTGCGTCCTTTACTCGAGTAAAGGACGCAGGAATGCCATTTTTTG,AATTCAAAAAATGGCATTCCTGCGTCCTTTACTCGAGTAAAGGACGCAGGAATGCCAT,n/a
human,9941,EXOG,XM_005265635.3,TRCN0000086808,NM_181399.2-3762s1c1,CCTCTTCTTGTATCTGAATAT,pLKO.1,1234,3UTR,85,89,,,Y,98910,Usp6nl,CCGGCCTCTTCTTGTATCTGAATATCTCGAGATATTCAGATACAAGAAGAGGTTTTTG,AATTCAAAAACCTCTTCTTGTATCTGAATATCTCGAGATATTCAGATACAAGAAGAGG,n/a
human,9941,EXOG,XM_005265635.3,TRCN0000162795,NM_017842.1-1079s1c1,CTTCCAAAGTGCTGGGATTAT,pLKO.1,1141,3UTR,85,89,,,Y,55652,SLC48A1,CCGGCTTCCAAAGTGCTGGGATTATCTCGAGATAATCCCAGCACTTTGGAAGTTTTTG,AATTCAAAAACTTCCAAAGTGCTGGGATTATCTCGAGATAATCCCAGCACTTTGGAAG,n/a
human,9941,EXOG,XM_005265635.3,TRCN0000140657,NM_012099.1-2957s1c1,CCTCCCAAAGTGCTAGGATAA,pLKO.1,1140,3UTR,85,89,,,Y,10849,CD3EAP,CCGGCCTCCCAAAGTGCTAGGATAACTCGAGTTATCCTAGCACTTTGGGAGGTTTTTG,AATTCAAAAACCTCCCAAAGTGCTAGGATAACTCGAGTTATCCTAGCACTTTGGGAGG,n/a
human,9941,EXOG,XM_005265635.3,TRCN0000129739,NM_152410.1-932s1c1,CTCTCAAGTAGCTGAGATTAT,pLKO.1,1002,3UTR,85,89,,,Y,135138,PACRG,CCGGCTCTCAAGTAGCTGAGATTATCTCGAGATAATCTCAGCTACTTGAGAGTTTTTG,AATTCAAAAACTCTCAAGTAGCTGAGATTATCTCGAGATAATCTCAGCTACTTGAGAG,n/a
human,9941,EXOG,XM_005265635.3,TRCN0000148755,NM_032285.1-1973s1c1,CGAACTCCTGACTCAAATGAT,pLKO.1,1105,3UTR,86,85,,,Y,84245,MRI1,CCGGCGAACTCCTGACTCAAATGATCTCGAGATCATTTGAGTCAGGAGTTCGTTTTTG,AATTCAAAAACGAACTCCTGACTCAAATGATCTCGAGATCATTTGAGTCAGGAGTTCG,n/a
