Taxon,"Gene ID","Gene Symbol",Transcript,"Clone ID","Legacy Clone Name","Target Seq",Vector,"Match Position","Match Region","Match %","SDR Match %","Intrinsic Score","Adjusted Score","Matches Other Gene in Same Taxon?","Orig. Target Gene ID","Orig. Target Gene Symbol","Forward Oligo Sequence","Reverse Oligo Sequence",Addgene
human,6405,SEMA3F,XM_006713290.3,TRCN0000373417,NM_004186.3-1441s21c1,GGAACCTTCACGCCATCTATG,pLKO_005,1378,CDS,100,100,10.8,15.12,N,6405,SEMA3F,CCGGGGAACCTTCACGCCATCTATGCTCGAGCATAGATGGCGTGAAGGTTCCTTTTTG,AATTCAAAAAGGAACCTTCACGCCATCTATGCTCGAGCATAGATGGCGTGAAGGTTCC,n/a
human,6405,SEMA3F,XM_006713290.3,TRCN0000061630,NM_004186.2-363s1c1,CGACTACCGAATCTTGCTCAA,pLKO.1,300,CDS,100,100,4.05,5.67,N,6405,SEMA3F,CCGGCGACTACCGAATCTTGCTCAACTCGAGTTGAGCAAGATTCGGTAGTCGTTTTTG,AATTCAAAAACGACTACCGAATCTTGCTCAACTCGAGTTGAGCAAGATTCGGTAGTCG,n/a
human,6405,SEMA3F,XM_006713290.3,TRCN0000373416,NM_004186.3-855s21c1,TGCTGGTGTGTACATCGATTT,pLKO_005,792,CDS,100,100,10.8,8.64,N,6405,SEMA3F,CCGGTGCTGGTGTGTACATCGATTTCTCGAGAAATCGATGTACACACCAGCATTTTTG,AATTCAAAAATGCTGGTGTGTACATCGATTTCTCGAGAAATCGATGTACACACCAGCA,n/a
human,6405,SEMA3F,XM_006713290.3,TRCN0000061631,NM_004186.2-1005s1c1,GCGCAATGATGATAAGCTTTA,pLKO.1,942,CDS,100,100,10.8,7.56,N,6405,SEMA3F,CCGGGCGCAATGATGATAAGCTTTACTCGAGTAAAGCTTATCATCATTGCGCTTTTTG,AATTCAAAAAGCGCAATGATGATAAGCTTTACTCGAGTAAAGCTTATCATCATTGCGC,n/a
human,6405,SEMA3F,XM_006713290.3,TRCN0000061628,NM_004186.2-1255s1c1,CCTGTCATTTACGCTGTCTTT,pLKO.1,1192,CDS,100,100,4.95,3.465,N,6405,SEMA3F,CCGGCCTGTCATTTACGCTGTCTTTCTCGAGAAAGACAGCGTAAATGACAGGTTTTTG,AATTCAAAAACCTGTCATTTACGCTGTCTTTCTCGAGAAAGACAGCGTAAATGACAGG,n/a
human,6405,SEMA3F,XM_006713290.3,TRCN0000061629,NM_004186.2-297s1c1,GCTCTCATTCAAAGAGCTGAA,pLKO.1,234,CDS,100,100,.405,.2835,N,6405,SEMA3F,CCGGGCTCTCATTCAAAGAGCTGAACTCGAGTTCAGCTCTTTGAATGAGAGCTTTTTG,AATTCAAAAAGCTCTCATTCAAAGAGCTGAACTCGAGTTCAGCTCTTTGAATGAGAGC,n/a
human,6405,SEMA3F,XM_006713290.3,TRCN0000373485,NM_004186.3-1316s21c1,TCTACTCCATGGCTGATATTC,pLKO_005,1253,CDS,100,100,13.2,7.92,N,6405,SEMA3F,CCGGTCTACTCCATGGCTGATATTCCTCGAGGAATATCAGCCATGGAGTAGATTTTTG,AATTCAAAAATCTACTCCATGGCTGATATTCCTCGAGGAATATCAGCCATGGAGTAGA,n/a
human,6405,SEMA3F,XM_006713290.3,TRCN0000054576,NM_011349.2-745s1c1,CCTCATCAATGAGGAACTCTA,pLKO.1,771,CDS,95,95,,,N,20350,Sema3f,CCGGCCTCATCAATGAGGAACTCTACTCGAGTAGAGTTCCTCATTGATGAGGTTTTTG,AATTCAAAAACCTCATCAATGAGGAACTCTACTCGAGTAGAGTTCCTCATTGATGAGG,n/a
human,6405,SEMA3F,XM_006713290.3,TRCN0000185721,NM_147064.1-294s1c1,GATACAGCTTTACTTCTTCAT,pLKO.1,952,CDS,90,95,,,N,259067,Olfr449,CCGGGATACAGCTTTACTTCTTCATCTCGAGATGAAGAAGTAAAGCTGTATCTTTTTG,AATTCAAAAAGATACAGCTTTACTTCTTCATCTCGAGATGAAGAAGTAAAGCTGTATC,n/a
human,6405,SEMA3F,XM_006713290.3,TRCN0000054573,NM_011349.2-1166s1c1,CCAGTCATTTATGCTGTCTTT,pLKO.1,1192,CDS,90,89,,,Y,20350,Sema3f,CCGGCCAGTCATTTATGCTGTCTTTCTCGAGAAAGACAGCATAAATGACTGGTTTTTG,AATTCAAAAACCAGTCATTTATGCTGTCTTTCTCGAGAAAGACAGCATAAATGACTGG,n/a
human,6405,SEMA3F,XM_006713290.3,TRCN0000312585,NM_020414.3-2177s21c1,CTGAGGATGTGATCAACTTTA,pLKO_005,1418,CDS,85,89,,,Y,57062,DDX24,CCGGCTGAGGATGTGATCAACTTTACTCGAGTAAAGTTGATCACATCCTCAGTTTTTG,AATTCAAAAACTGAGGATGTGATCAACTTTACTCGAGTAAAGTTGATCACATCCTCAG,n/a
human,6405,SEMA3F,XM_006713290.3,TRCN0000102988,NM_001005846.1-917s1c1,GCTGAGGAAGAGATTTCTAAA,pLKO.1,76,5UTR,85,89,,,Y,68279,Mcoln2,CCGGGCTGAGGAAGAGATTTCTAAACTCGAGTTTAGAAATCTCTTCCTCAGCTTTTTG,AATTCAAAAAGCTGAGGAAGAGATTTCTAAACTCGAGTTTAGAAATCTCTTCCTCAGC,n/a
human,6405,SEMA3F,XM_006713290.3,TRCN0000061039,NM_020241.2-409s1c1,GCGAGTGTCGAAACTTCGTAA,pLKO.1,473,CDS,85,89,,,Y,10501,SEMA6B,CCGGGCGAGTGTCGAAACTTCGTAACTCGAGTTACGAAGTTTCGACACTCGCTTTTTG,AATTCAAAAAGCGAGTGTCGAAACTTCGTAACTCGAGTTACGAAGTTTCGACACTCGC,n/a
human,6405,SEMA3F,XM_006713290.3,TRCN0000122967,NM_020812.1-1023s1c1,CCTGGTCATCAAGTTGGAGAA,pLKO.1,1062,CDS,85,89,,,Y,57572,DOCK6,CCGGCCTGGTCATCAAGTTGGAGAACTCGAGTTCTCCAACTTGATGACCAGGTTTTTG,AATTCAAAAACCTGGTCATCAAGTTGGAGAACTCGAGTTCTCCAACTTGATGACCAGG,n/a
human,6405,SEMA3F,XM_006713290.3,TRCN0000022453,NM_025241.1-189s1c1,CCACAAAGAGAAGCCCAACCA,pLKO.1,1299,CDS,85,89,,,Y,80700,UBXN6,CCGGCCACAAAGAGAAGCCCAACCACTCGAGTGGTTGGGCTTCTCTTTGTGGTTTTTG,AATTCAAAAACCACAAAGAGAAGCCCAACCACTCGAGTGGTTGGGCTTCTCTTTGTGG,n/a
human,6405,SEMA3F,XM_006713290.3,TRCN0000054577,NM_011349.2-911s1c1,GCAGAGCGCAATGACGATAAA,pLKO.1,937,CDS,85,89,,,Y,20350,Sema3f,CCGGGCAGAGCGCAATGACGATAAACTCGAGTTTATCGTCATTGCGCTCTGCTTTTTG,AATTCAAAAAGCAGAGCGCAATGACGATAAACTCGAGTTTATCGTCATTGCGCTCTGC,n/a
human,6405,SEMA3F,XM_006713290.3,TRCN0000238534,NM_001081340.1-2442s21c1,TCAACGAAGTGGATCACATTT,pLKO_005,1067,CDS,85,89,,,Y,235626,Setd2,CCGGTCAACGAAGTGGATCACATTTCTCGAGAAATGTGATCCACTTCGTTGATTTTTG,AATTCAAAAATCAACGAAGTGGATCACATTTCTCGAGAAATGTGATCCACTTCGTTGA,n/a
human,6405,SEMA3F,XM_006713290.3,TRCN0000091632,NM_009936.1-132s1c1,CCCGGCAAGGATGGCATTGAT,pLKO.1,1114,CDS,85,89,,,Y,12841,Col9a3,CCGGCCCGGCAAGGATGGCATTGATCTCGAGATCAATGCCATCCTTGCCGGGTTTTTG,AATTCAAAAACCCGGCAAGGATGGCATTGATCTCGAGATCAATGCCATCCTTGCCGGG,n/a
human,6405,SEMA3F,XM_006713290.3,TRCN0000334119,NM_009936.2-153s21c1,CCCGGCAAGGATGGCATTGAT,pLKO_005,1114,CDS,85,89,,,Y,12841,Col9a3,CCGGCCCGGCAAGGATGGCATTGATCTCGAGATCAATGCCATCCTTGCCGGGTTTTTG,AATTCAAAAACCCGGCAAGGATGGCATTGATCTCGAGATCAATGCCATCCTTGCCGGG,n/a
human,6405,SEMA3F,XM_006713290.3,TRCN0000055034,NM_008401.1-2767s1c1,CGCCTCAATTATACACTGGTT,pLKO.1,400,CDS,80,89,,,N,16409,Itgam,CCGGCGCCTCAATTATACACTGGTTCTCGAGAACCAGTGTATAATTGAGGCGTTTTTG,AATTCAAAAACGCCTCAATTATACACTGGTTCTCGAGAACCAGTGTATAATTGAGGCG,n/a
human,6405,SEMA3F,XM_006713290.3,TRCN0000094048,NM_016893.2-1280s1c1,GCTGGTGTGTAACATCAATAA,pLKO.1,793,CDS,80,89,,,Y,53618,Fut8,CCGGGCTGGTGTGTAACATCAATAACTCGAGTTATTGATGTTACACACCAGCTTTTTG,AATTCAAAAAGCTGGTGTGTAACATCAATAACTCGAGTTATTGATGTTACACACCAGC,n/a
human,6405,SEMA3F,XM_006713290.3,TRCN0000349474,NM_016893.4-1279s21c1,GCTGGTGTGTAACATCAATAA,pLKO_005,793,CDS,80,89,,,Y,53618,Fut8,CCGGGCTGGTGTGTAACATCAATAACTCGAGTTATTGATGTTACACACCAGCTTTTTG,AATTCAAAAAGCTGGTGTGTAACATCAATAACTCGAGTTATTGATGTTACACACCAGC,n/a
human,6405,SEMA3F,XM_006713290.3,TRCN0000179800,NM_004704.2-1041s1c1,CCTAATCAATGAGGAGCACAT,pLKO.1,771,CDS,80,89,,,Y,9136,RRP9,CCGGCCTAATCAATGAGGAGCACATCTCGAGATGTGCTCCTCATTGATTAGGTTTTTG,AATTCAAAAACCTAATCAATGAGGAGCACATCTCGAGATGTGCTCCTCATTGATTAGG,n/a
human,6405,SEMA3F,XM_006713290.3,TRCN0000165991,NM_016459.2-601s1c1,GATCTATGAAGCCCACCAACA,pLKO.1,1391,CDS,80,89,,,Y,51237,MZB1,CCGGGATCTATGAAGCCCACCAACACTCGAGTGTTGGTGGGCTTCATAGATCTTTTTG,AATTCAAAAAGATCTATGAAGCCCACCAACACTCGAGTGTTGGTGGGCTTCATAGATC,n/a
human,6405,SEMA3F,XM_006713290.3,TRCN0000049605,NM_006122.1-1377s1c1,GCCCAGTTCTTCAACTACCAA,pLKO.1,268,CDS,80,89,,,Y,4122,MAN2A2,CCGGGCCCAGTTCTTCAACTACCAACTCGAGTTGGTAGTTGAAGAACTGGGCTTTTTG,AATTCAAAAAGCCCAGTTCTTCAACTACCAACTCGAGTTGGTAGTTGAAGAACTGGGC,n/a
human,6405,SEMA3F,XM_006713290.3,TRCN0000065641,NM_207263.1-229s1c1,CCAGTGGATGTCCTTGTCATA,pLKO.1,1320,CDS,80,89,,,Y,384997,Pglyrp4,CCGGCCAGTGGATGTCCTTGTCATACTCGAGTATGACAAGGACATCCACTGGTTTTTG,AATTCAAAAACCAGTGGATGTCCTTGTCATACTCGAGTATGACAAGGACATCCACTGG,n/a
human,6405,SEMA3F,XM_006713290.3,TRCN0000247134,NM_177139.3-884s21c1,TCATCGCAGCCACCCATTAAT,pLKO_005,1436,CDS,86,85,,,N,320343,Lypd6,CCGGTCATCGCAGCCACCCATTAATCTCGAGATTAATGGGTGGCTGCGATGATTTTTG,AATTCAAAAATCATCGCAGCCACCCATTAATCTCGAGATTAATGGGTGGCTGCGATGA,n/a
human,6405,SEMA3F,XM_006713290.3,TRCN0000189368,NM_025503.1-271s1c1,CGCCGTCTTCTTCTTTGGTTT,pLKO.1,144,CDS,81,85,,,Y,66346,1700029P11Rik,CCGGCGCCGTCTTCTTCTTTGGTTTCTCGAGAAACCAAAGAAGAAGACGGCGTTTTTG,AATTCAAAAACGCCGTCTTCTTCTTTGGTTTCTCGAGAAACCAAAGAAGAAGACGGCG,n/a
human,6405,SEMA3F,XM_006713290.3,TRCN0000419634,NM_004424.3-896s21c1,AGGACGTGGTTGTCAGCAAAG,pLKO_005,1154,CDS,81,85,,,Y,1877,E4F1,CCGGAGGACGTGGTTGTCAGCAAAGCTCGAGCTTTGCTGACAACCACGTCCTTTTTTG,AATTCAAAAAAGGACGTGGTTGTCAGCAAAGCTCGAGCTTTGCTGACAACCACGTCCT,n/a
human,6405,SEMA3F,XM_006713290.3,TRCN0000583834,,TCTTCTACCTGACCCTGATTG,pLKO_005,692,CDS,81,85,,,Y,403244,OR2T35,CCGGTCTTCTACCTGACCCTGATTGCTCGAGCAATCAGGGTCAGGTAGAAGATTTTTG,AATTCAAAAATCTTCTACCTGACCCTGATTGCTCGAGCAATCAGGGTCAGGTAGAAGA,n/a
human,6405,SEMA3F,XM_006713290.3,TRCN0000009470,NM_002566.3-1403s1c1,GAGAGAGTGGAGCTGCTTTAT,pLKO.1,93,5UTR,81,85,,,Y,5032,P2RY11,CCGGGAGAGAGTGGAGCTGCTTTATCTCGAGATAAAGCAGCTCCACTCTCTCTTTTTG,AATTCAAAAAGAGAGAGTGGAGCTGCTTTATCTCGAGATAAAGCAGCTCCACTCTCTC,n/a
