Taxon,"Gene ID","Gene Symbol",Transcript,"Clone ID","Legacy Clone Name","Target Seq",Vector,"Match Position","Match Region","Match %","SDR Match %","Intrinsic Score","Adjusted Score","Matches Other Gene in Same Taxon?","Orig. Target Gene ID","Orig. Target Gene Symbol","Forward Oligo Sequence","Reverse Oligo Sequence",Addgene
human,79618,HMBOX1,XM_011544642.2,TRCN0000015011,NM_024567.1-185s1c1,GAGGGAGAATAATGAGCGATT,pLKO.1,696,CDS,100,100,4.05,5.67,N,79618,HMBOX1,CCGGGAGGGAGAATAATGAGCGATTCTCGAGAATCGCTCATTATTCTCCCTCTTTTTG,AATTCAAAAAGAGGGAGAATAATGAGCGATTCTCGAGAATCGCTCATTATTCTCCCTC,n/a
human,79618,HMBOX1,XM_011544642.2,TRCN0000285018,NM_024567.3-754s21c1,GAGGGAGAATAATGAGCGATT,pLKO_005,696,CDS,100,100,4.05,5.67,N,79618,HMBOX1,CCGGGAGGGAGAATAATGAGCGATTCTCGAGAATCGCTCATTATTCTCCCTCTTTTTG,AATTCAAAAAGAGGGAGAATAATGAGCGATTCTCGAGAATCGCTCATTATTCTCCCTC,n/a
human,79618,HMBOX1,XM_011544642.2,TRCN0000015009,NM_024567.1-497s1c1,CCGATGGTATCAACTTGAGAA,pLKO.1,1008,CDS,100,100,4.95,3.465,N,79618,HMBOX1,CCGGCCGATGGTATCAACTTGAGAACTCGAGTTCTCAAGTTGATACCATCGGTTTTTG,AATTCAAAAACCGATGGTATCAACTTGAGAACTCGAGTTCTCAAGTTGATACCATCGG,n/a
human,79618,HMBOX1,XM_011544642.2,TRCN0000085935,NM_177338.3-356s1c1,GCTGGAAACCATGTCTCACTA,pLKO.1,369,CDS,95,95,,,N,219150,Hmbox1,CCGGGCTGGAAACCATGTCTCACTACTCGAGTAGTGAGACATGGTTTCCAGCTTTTTG,AATTCAAAAAGCTGGAAACCATGTCTCACTACTCGAGTAGTGAGACATGGTTTCCAGC,n/a
human,79618,HMBOX1,XM_011544642.2,TRCN0000301803,NM_177338.5-355s21c1,GCTGGAAACCATGTCTCACTA,pLKO_005,369,CDS,95,95,,,N,219150,Hmbox1,CCGGGCTGGAAACCATGTCTCACTACTCGAGTAGTGAGACATGGTTTCCAGCTTTTTG,AATTCAAAAAGCTGGAAACCATGTCTCACTACTCGAGTAGTGAGACATGGTTTCCAGC,n/a
human,79618,HMBOX1,XM_011544642.2,TRCN0000175152,NM_026083.1-527s1c1,GATTCTGACAATGGAGATATT,pLKO.1,277,5UTR,81,90,,,Y,67302,Zc3h13,CCGGGATTCTGACAATGGAGATATTCTCGAGAATATCTCCATTGTCAGAATCTTTTTG,AATTCAAAAAGATTCTGACAATGGAGATATTCTCGAGAATATCTCCATTGTCAGAATC,n/a
human,79618,HMBOX1,XM_011544642.2,TRCN0000270474,NM_001029930.1-660s21c1,AGGAACAGCAGTGTGATATAG,pLKO_005,844,CDS,85,89,,,Y,545007,Gm5796,CCGGAGGAACAGCAGTGTGATATAGCTCGAGCTATATCACACTGCTGTTCCTTTTTTG,AATTCAAAAAAGGAACAGCAGTGTGATATAGCTCGAGCTATATCACACTGCTGTTCCT,n/a
human,79618,HMBOX1,XM_011544642.2,TRCN0000001266,NM_012141.x-2841s1c1,CCAGCATCTTCACTCAACAAA,pLKO.1,580,CDS,80,89,,,Y,26512,INTS6,CCGGCCAGCATCTTCACTCAACAAACTCGAGTTTGTTGAGTGAAGATGCTGGTTTTTG,AATTCAAAAACCAGCATCTTCACTCAACAAACTCGAGTTTGTTGAGTGAAGATGCTGG,n/a
human,79618,HMBOX1,XM_011544642.2,TRCN0000379804,NM_024798.2-560s21c1,CCTCTACAGCTTCAGCATCAG,pLKO_005,590,CDS,80,89,,,Y,79856,SNX22,CCGGCCTCTACAGCTTCAGCATCAGCTCGAGCTGATGCTGAAGCTGTAGAGGTTTTTG,AATTCAAAAACCTCTACAGCTTCAGCATCAGCTCGAGCTGATGCTGAAGCTGTAGAGG,n/a
human,79618,HMBOX1,XM_011544642.2,TRCN0000033532,NM_001205.1-617s1c1,CTTCTCATCTTCCTTGCGCTA,pLKO.1,112,5UTR,80,89,,,Y,662,BNIP1,CCGGCTTCTCATCTTCCTTGCGCTACTCGAGTAGCGCAAGGAAGATGAGAAGTTTTTG,AATTCAAAAACTTCTCATCTTCCTTGCGCTACTCGAGTAGCGCAAGGAAGATGAGAAG,n/a
human,79618,HMBOX1,XM_011544642.2,TRCN0000126336,NM_025911.2-1144s1c1,CAATGAAAGATGTCATCACTA,pLKO.1,726,CDS,77,85,,,Y,67015,Ccdc91,CCGGCAATGAAAGATGTCATCACTACTCGAGTAGTGATGACATCTTTCATTGTTTTTG,AATTCAAAAACAATGAAAGATGTCATCACTACTCGAGTAGTGATGACATCTTTCATTG,n/a
