Taxon,"Gene ID","Gene Symbol",Transcript,"Clone ID","Legacy Clone Name","Target Seq",Vector,"Match Position","Match Region","Match %","SDR Match %","Intrinsic Score","Adjusted Score","Matches Other Gene in Same Taxon?","Orig. Target Gene ID","Orig. Target Gene Symbol","Forward Oligo Sequence","Reverse Oligo Sequence",Addgene
human,4121,MAN1A1,XM_011535833.2,TRCN0000378329,NM_005907.2-1796s21c1,TCTAGCAGCGGACTAACTTAT,pLKO_005,853,CDS,100,100,13.2,18.48,N,4121,MAN1A1,CCGGTCTAGCAGCGGACTAACTTATCTCGAGATAAGTTAGTCCGCTGCTAGATTTTTG,AATTCAAAAATCTAGCAGCGGACTAACTTATCTCGAGATAAGTTAGTCCGCTGCTAGA,n/a
human,4121,MAN1A1,XM_011535833.2,TRCN0000049600,NM_005907.2-1606s1c1,CCTTTATCCTAACTATCTGAA,pLKO.1,663,CDS,100,100,4.95,6.93,N,4121,MAN1A1,CCGGCCTTTATCCTAACTATCTGAACTCGAGTTCAGATAGTTAGGATAAAGGTTTTTG,AATTCAAAAACCTTTATCCTAACTATCTGAACTCGAGTTCAGATAGTTAGGATAAAGG,n/a
human,4121,MAN1A1,XM_011535833.2,TRCN0000049598,NM_005907.2-1774s1c1,CGAGACTCATTTGATCCGCAA,pLKO.1,831,CDS,100,100,2.16,3.024,N,4121,MAN1A1,CCGGCGAGACTCATTTGATCCGCAACTCGAGTTGCGGATCAAATGAGTCTCGTTTTTG,AATTCAAAAACGAGACTCATTTGATCCGCAACTCGAGTTGCGGATCAAATGAGTCTCG,n/a
human,4121,MAN1A1,XM_011535833.2,TRCN0000359712,NM_005907.2-2436s21c1,CCCTTCACTGTATACCTTAAT,pLKO_005,1493,3UTR,100,100,13.2,9.24,N,4121,MAN1A1,CCGGCCCTTCACTGTATACCTTAATCTCGAGATTAAGGTATACAGTGAAGGGTTTTTG,AATTCAAAAACCCTTCACTGTATACCTTAATCTCGAGATTAAGGTATACAGTGAAGGG,n/a
human,4121,MAN1A1,XM_011535833.2,TRCN0000359711,NM_005907.2-2566s21c1,GACCTAAATTCCTTATCATAT,pLKO_005,1623,3UTR,100,100,13.2,9.24,N,4121,MAN1A1,CCGGGACCTAAATTCCTTATCATATCTCGAGATATGATAAGGAATTTAGGTCTTTTTG,AATTCAAAAAGACCTAAATTCCTTATCATATCTCGAGATATGATAAGGAATTTAGGTC,n/a
human,4121,MAN1A1,XM_011535833.2,TRCN0000359778,NM_005907.2-1305s21c1,GACTACTCTCAGCCTACTATC,pLKO_005,362,CDS,100,100,10.8,7.56,N,4121,MAN1A1,CCGGGACTACTCTCAGCCTACTATCCTCGAGGATAGTAGGCTGAGAGTAGTCTTTTTG,AATTCAAAAAGACTACTCTCAGCCTACTATCCTCGAGGATAGTAGGCTGAGAGTAGTC,n/a
human,4121,MAN1A1,XM_011535833.2,TRCN0000049599,NM_005907.2-2178s1c1,GCAGAGTGAATGGAGGCTATT,pLKO.1,1235,CDS,100,100,10.8,7.56,N,4121,MAN1A1,CCGGGCAGAGTGAATGGAGGCTATTCTCGAGAATAGCCTCCATTCACTCTGCTTTTTG,AATTCAAAAAGCAGAGTGAATGGAGGCTATTCTCGAGAATAGCCTCCATTCACTCTGC,n/a
human,4121,MAN1A1,XM_011535833.2,TRCN0000055383,NM_008548.2-1428s1c1,CGAAAGAAAGCAGTGGAACTT,pLKO.1,403,CDS,100,100,4.95,3.465,N,17155,Man1a,CCGGCGAAAGAAAGCAGTGGAACTTCTCGAGAAGTTCCACTGCTTTCTTTCGTTTTTG,AATTCAAAAACGAAAGAAAGCAGTGGAACTTCTCGAGAAGTTCCACTGCTTTCTTTCG,n/a
human,4121,MAN1A1,XM_011535833.2,TRCN0000049602,NM_005907.2-1143s1c1,GTAACATCAAAGGAGCAACTA,pLKO.1,200,CDS,100,100,4.95,3.465,N,4121,MAN1A1,CCGGGTAACATCAAAGGAGCAACTACTCGAGTAGTTGCTCCTTTGATGTTACTTTTTG,AATTCAAAAAGTAACATCAAAGGAGCAACTACTCGAGTAGTTGCTCCTTTGATGTTAC,n/a
human,4121,MAN1A1,XM_011535833.2,TRCN0000018471,NM_008548.2-1243s1c1,CAATAGTAGATGCCCTGGATA,pLKO.1,218,CDS,95,95,,,N,17155,Man1a,CCGGCAATAGTAGATGCCCTGGATACTCGAGTATCCAGGGCATCTACTATTGTTTTTG,AATTCAAAAACAATAGTAGATGCCCTGGATACTCGAGTATCCAGGGCATCTACTATTG,n/a
human,4121,MAN1A1,XM_011535833.2,TRCN0000055386,NM_008548.2-2038s1c1,CCCGCACTTGTCATGAATCTT,pLKO.1,1013,CDS,90,95,,,N,17155,Man1a,CCGGCCCGCACTTGTCATGAATCTTCTCGAGAAGATTCATGACAAGTGCGGGTTTTTG,AATTCAAAAACCCGCACTTGTCATGAATCTTCTCGAGAAGATTCATGACAAGTGCGGG,n/a
human,4121,MAN1A1,XM_011535833.2,TRCN0000104699,NM_134094.2-654s1c1,GCTTCCAAATTTGCAGAGCAT,pLKO.1,2224,3UTR,81,90,,,Y,52589,Ncald,CCGGGCTTCCAAATTTGCAGAGCATCTCGAGATGCTCTGCAAATTTGGAAGCTTTTTG,AATTCAAAAAGCTTCCAAATTTGCAGAGCATCTCGAGATGCTCTGCAAATTTGGAAGC,n/a
human,4121,MAN1A1,XM_011535833.2,TRCN0000327293,NM_134094.3-653s21c1,GCTTCCAAATTTGCAGAGCAT,pLKO_005,2224,3UTR,81,90,,,Y,52589,Ncald,CCGGGCTTCCAAATTTGCAGAGCATCTCGAGATGCTCTGCAAATTTGGAAGCTTTTTG,AATTCAAAAAGCTTCCAAATTTGCAGAGCATCTCGAGATGCTCTGCAAATTTGGAAGC,n/a
human,4121,MAN1A1,XM_011535833.2,TRCN0000105257,NM_007435.1-1641s1c1,CGAAAGGATCATGTCATCTTA,pLKO.1,2044,3UTR,85,89,,,N,11666,Abcd1,CCGGCGAAAGGATCATGTCATCTTACTCGAGTAAGATGACATGATCCTTTCGTTTTTG,AATTCAAAAACGAAAGGATCATGTCATCTTACTCGAGTAAGATGACATGATCCTTTCG,n/a
human,4121,MAN1A1,XM_011535833.2,TRCN0000413143,NM_032135.3-669s21c1,CATACCTTCAGTTCAACTAAA,pLKO_005,3253,3UTR,85,89,,,Y,84075,FSCB,CCGGCATACCTTCAGTTCAACTAAACTCGAGTTTAGTTGAACTGAAGGTATGTTTTTG,AATTCAAAAACATACCTTCAGTTCAACTAAACTCGAGTTTAGTTGAACTGAAGGTATG,n/a
human,4121,MAN1A1,XM_011535833.2,TRCN0000368734,NM_009469.3-597s21c1,CTTCCAGGAAATGGCTAATTC,pLKO_005,2822,3UTR,85,89,,,Y,22241,Ulk1,CCGGCTTCCAGGAAATGGCTAATTCCTCGAGGAATTAGCCATTTCCTGGAAGTTTTTG,AATTCAAAAACTTCCAGGAAATGGCTAATTCCTCGAGGAATTAGCCATTTCCTGGAAG,n/a
human,4121,MAN1A1,XM_011535833.2,TRCN0000296303,NM_177556.1-1422s21c1,TTACAAGAAAGGGCTAATAAG,pLKO_005,2823,3UTR,85,89,,,Y,7216,TRO,CCGGTTACAAGAAAGGGCTAATAAGCTCGAGCTTATTAGCCCTTTCTTGTAATTTTTG,AATTCAAAAATTACAAGAAAGGGCTAATAAGCTCGAGCTTATTAGCCCTTTCTTGTAA,n/a
human,4121,MAN1A1,XM_011535833.2,TRCN0000187545,NM_178731.2-1233s1c1,GTCAACACAGAACGATCACAT,pLKO.1,2613,3UTR,85,89,,,Y,243499,Lrrtm4,CCGGGTCAACACAGAACGATCACATCTCGAGATGTGATCGTTCTGTGTTGACTTTTTG,AATTCAAAAAGTCAACACAGAACGATCACATCTCGAGATGTGATCGTTCTGTGTTGAC,n/a
human,4121,MAN1A1,XM_011535833.2,TRCN0000095046,NM_198011.1-1230s1c1,CGCATATCTTCAGTGTCACAT,pLKO.1,3251,3UTR,85,89,,,Y,101604,E430018J23Rik,CCGGCGCATATCTTCAGTGTCACATCTCGAGATGTGACACTGAAGATATGCGTTTTTG,AATTCAAAAACGCATATCTTCAGTGTCACATCTCGAGATGTGACACTGAAGATATGCG,n/a
human,4121,MAN1A1,XM_011535833.2,TRCN0000055384,NM_008548.2-2314s1c1,GTTATGACGATGTCCAGCAAA,pLKO.1,1289,CDS,85,89,,,Y,17155,Man1a,CCGGGTTATGACGATGTCCAGCAAACTCGAGTTTGCTGGACATCGTCATAACTTTTTG,AATTCAAAAAGTTATGACGATGTCCAGCAAACTCGAGTTTGCTGGACATCGTCATAAC,n/a
human,4121,MAN1A1,XM_011535833.2,TRCN0000287163,NM_008548.4-2313s21c1,GTTATGACGATGTCCAGCAAA,pLKO_005,1289,CDS,85,89,,,Y,17155,Man1a,CCGGGTTATGACGATGTCCAGCAAACTCGAGTTTGCTGGACATCGTCATAACTTTTTG,AATTCAAAAAGTTATGACGATGTCCAGCAAACTCGAGTTTGCTGGACATCGTCATAAC,n/a
human,4121,MAN1A1,XM_011535833.2,TRCN0000096025,NM_001004167.1-422s1c1,GTGACTTATGATGATGTGCAT,pLKO.1,1285,CDS,85,89,,,Y,,,CCGGGTGACTTATGATGATGTGCATCTCGAGATGCACATCATCATAAGTCACTTTTTG,AATTCAAAAAGTGACTTATGATGATGTGCATCTCGAGATGCACATCATCATAAGTCAC,n/a
human,4121,MAN1A1,XM_011535833.2,TRCN0000341829,NM_001159507.1-3053s21c1,ATGTTCGCACTCGGGACTTTG,pLKO_005,940,CDS,80,89,,,N,243547,Grip2,CCGGATGTTCGCACTCGGGACTTTGCTCGAGCAAAGTCCCGAGTGCGAACATTTTTTG,AATTCAAAAAATGTTCGCACTCGGGACTTTGCTCGAGCAAAGTCCCGAGTGCGAACAT,n/a
human,4121,MAN1A1,XM_011535833.2,TRCN0000422474,NM_144934.3-805s21c1,AGTCAGATCTGGAAGGTAAAG,pLKO_005,782,CDS,80,89,,,N,234988,Mbd3l2,CCGGAGTCAGATCTGGAAGGTAAAGCTCGAGCTTTACCTTCCAGATCTGACTTTTTTG,AATTCAAAAAAGTCAGATCTGGAAGGTAAAGCTCGAGCTTTACCTTCCAGATCTGACT,n/a
human,4121,MAN1A1,XM_011535833.2,TRCN0000044881,NM_205850.1-1377s1c1,GCAGAGGACTAACTTACATAA,pLKO.1,857,CDS,80,89,,,Y,283652,SLC24A5,CCGGGCAGAGGACTAACTTACATAACTCGAGTTATGTAAGTTAGTCCTCTGCTTTTTG,AATTCAAAAAGCAGAGGACTAACTTACATAACTCGAGTTATGTAAGTTAGTCCTCTGC,n/a
human,4121,MAN1A1,XM_011535833.2,TRCN0000063286,NM_000831.2-358s1c1,CCCAACACAACCTTGACCTAT,pLKO.1,980,CDS,80,89,,,Y,2899,GRIK3,CCGGCCCAACACAACCTTGACCTATCTCGAGATAGGTCAAGGTTGTGTTGGGTTTTTG,AATTCAAAAACCCAACACAACCTTGACCTATCTCGAGATAGGTCAAGGTTGTGTTGGG,n/a
human,4121,MAN1A1,XM_011535833.2,TRCN0000412792,NM_001189.3-843s21c1,ACCGTCGCTACAAGACAAAGC,pLKO_005,1093,CDS,80,89,,,Y,579,NKX3-2,CCGGACCGTCGCTACAAGACAAAGCCTCGAGGCTTTGTCTTGTAGCGACGGTTTTTTG,AATTCAAAAAACCGTCGCTACAAGACAAAGCCTCGAGGCTTTGTCTTGTAGCGACGGT,n/a
human,4121,MAN1A1,XM_011535833.2,TRCN0000014693,NM_006608.1-2650s1c1,GCAACTATGATAGATGCCCAA,pLKO.1,214,CDS,80,89,,,Y,10745,PHTF1,CCGGGCAACTATGATAGATGCCCAACTCGAGTTGGGCATCTATCATAGTTGCTTTTTG,AATTCAAAAAGCAACTATGATAGATGCCCAACTCGAGTTGGGCATCTATCATAGTTGC,n/a
human,4121,MAN1A1,XM_011535833.2,TRCN0000143704,NM_001010971.1-337s1c1,GATGTCGTCAATTATTTCCGA,pLKO.1,2466,3UTR,80,89,,,Y,148418,SAMD13,CCGGGATGTCGTCAATTATTTCCGACTCGAGTCGGAAATAATTGACGACATCTTTTTG,AATTCAAAAAGATGTCGTCAATTATTTCCGACTCGAGTCGGAAATAATTGACGACATC,n/a
human,4121,MAN1A1,XM_011535833.2,TRCN0000150723,NM_153447.2-3391s1c1,CAGAATAACTTCAGTCCCAAA,pLKO.1,3234,3UTR,80,89,,,Y,126206,NLRP5,CCGGCAGAATAACTTCAGTCCCAAACTCGAGTTTGGGACTGAAGTTATTCTGTTTTTG,AATTCAAAAACAGAATAACTTCAGTCCCAAACTCGAGTTTGGGACTGAAGTTATTCTG,n/a
