Taxon,"Gene ID","Gene Symbol",Transcript,"Clone ID","Legacy Clone Name","Target Seq",Vector,"Match Position","Match Region","Match %","SDR Match %","Intrinsic Score","Adjusted Score","Matches Other Gene in Same Taxon?","Orig. Target Gene ID","Orig. Target Gene Symbol","Forward Oligo Sequence","Reverse Oligo Sequence",Addgene
human,7123,CLEC3B,XM_017007116.1,TRCN0000371799,NM_003278.2-636s21c1,CAACGGCAAGTGGTTCGACAA,pLKO_005,597,CDS,100,100,4.05,5.67,N,7123,CLEC3B,CCGGCAACGGCAAGTGGTTCGACAACTCGAGTTGTCGAACCACTTGCCGTTGTTTTTG,AATTCAAAAACAACGGCAAGTGGTTCGACAACTCGAGTTGTCGAACCACTTGCCGTTG,n/a
human,7123,CLEC3B,XM_017007116.1,TRCN0000062477,NM_003278.1-318s1c1,CAAGGTGCACATGAAATGCTT,pLKO.1,282,CDS,100,100,3,2.4,N,7123,CLEC3B,CCGGCAAGGTGCACATGAAATGCTTCTCGAGAAGCATTTCATGTGCACCTTGTTTTTG,AATTCAAAAACAAGGTGCACATGAAATGCTTCTCGAGAAGCATTTCATGTGCACCTTG,n/a
human,7123,CLEC3B,XM_017007116.1,TRCN0000062474,NM_003278.1-169s1c1,CAGAAGCCCAAGAAGATTGTA,pLKO.1,232,CDS,100,100,5.625,3.9375,N,7123,CLEC3B,CCGGCAGAAGCCCAAGAAGATTGTACTCGAGTACAATCTTCTTGGGCTTCTGTTTTTG,AATTCAAAAACAGAAGCCCAAGAAGATTGTACTCGAGTACAATCTTCTTGGGCTTCTG,n/a
human,7123,CLEC3B,XM_017007116.1,TRCN0000371800,NM_003278.2-183s21c1,GAAGATTGTAAATGCCAAGAA,pLKO_005,243,CDS,100,100,4.95,3.465,N,7123,CLEC3B,CCGGGAAGATTGTAAATGCCAAGAACTCGAGTTCTTGGCATTTACAATCTTCTTTTTG,AATTCAAAAAGAAGATTGTAAATGCCAAGAACTCGAGTTCTTGGCATTTACAATCTTC,n/a
human,7123,CLEC3B,XM_017007116.1,TRCN0000062476,NM_003278.1-550s1c1,GCCTACAAGAACTGGGAGACT,pLKO.1,514,CDS,100,100,2.64,1.584,N,7123,CLEC3B,CCGGGCCTACAAGAACTGGGAGACTCTCGAGAGTCTCCCAGTTCTTGTAGGCTTTTTG,AATTCAAAAAGCCTACAAGAACTGGGAGACTCTCGAGAGTCTCCCAGTTCTTGTAGGC,n/a
human,7123,CLEC3B,XM_017007116.1,TRCN0000119433,NM_011606.1-762s1c1,CCGCGATCAGTTGCCCTACAT,pLKO.1,624,CDS,95,95,,,N,21922,Clec3b,CCGGCCGCGATCAGTTGCCCTACATCTCGAGATGTAGGGCAACTGATCGCGGTTTTTG,AATTCAAAAACCGCGATCAGTTGCCCTACATCTCGAGATGTAGGGCAACTGATCGCGG,n/a
human,7123,CLEC3B,XM_017007116.1,TRCN0000378975,NM_006744.3-576s21c1,AGAAGCGCAGAAGATTGTAAG,pLKO_005,233,CDS,86,90,,,Y,5950,RBP4,CCGGAGAAGCGCAGAAGATTGTAAGCTCGAGCTTACAATCTTCTGCGCTTCTTTTTTG,AATTCAAAAAAGAAGCGCAGAAGATTGTAAGCTCGAGCTTACAATCTTCTGCGCTTCT,n/a
human,7123,CLEC3B,XM_017007116.1,TRCN0000256889,NM_145662.2-111s21c1,TTCCAACGAGGCCAACGAGAT,pLKO_005,328,CDS,80,89,,,Y,728712,SPANXA2,CCGGTTCCAACGAGGCCAACGAGATCTCGAGATCTCGTTGGCCTCGTTGGAATTTTTG,AATTCAAAAATTCCAACGAGGCCAACGAGATCTCGAGATCTCGTTGGCCTCGTTGGAA,n/a
human,7123,CLEC3B,XM_017007116.1,TRCN0000265427,NM_001111319.1-1181s21c1,CAAGAACTGGAGACGAGAAAC,pLKO_005,519,CDS,78,86,,,Y,53842,CLDN22,CCGGCAAGAACTGGAGACGAGAAACCTCGAGGTTTCTCGTCTCCAGTTCTTGTTTTTG,AATTCAAAAACAAGAACTGGAGACGAGAAACCTCGAGGTTTCTCGTCTCCAGTTCTTG,n/a
human,7123,CLEC3B,XM_017007116.1,TRCN0000040181,NM_000548.2-413s1c1,CCAACGAAGACCTTCACGAAA,pLKO.1,316,CDS,77,85,,,Y,7249,TSC2,CCGGCCAACGAAGACCTTCACGAAACTCGAGTTTCGTGAAGGTCTTCGTTGGTTTTTG,AATTCAAAAACCAACGAAGACCTTCACGAAACTCGAGTTTCGTGAAGGTCTTCGTTGG,n/a
human,7123,CLEC3B,XM_017007116.1,TRCN0000080359,NM_009243.1-166s1c1,GCTACAAACCTGGGAGACTTT,pLKO.1,515,CDS,77,85,,,Y,20700,Serpina1a,CCGGGCTACAAACCTGGGAGACTTTCTCGAGAAAGTCTCCCAGGTTTGTAGCTTTTTG,AATTCAAAAAGCTACAAACCTGGGAGACTTTCTCGAGAAAGTCTCCCAGGTTTGTAGC,n/a
