Taxon,"Gene ID","Gene Symbol",Transcript,"Clone ID","Legacy Clone Name","Target Seq",Vector,"Match Position","Match Region","Match %","SDR Match %","Intrinsic Score","Adjusted Score","Matches Other Gene in Same Taxon?","Orig. Target Gene ID","Orig. Target Gene Symbol","Forward Oligo Sequence","Reverse Oligo Sequence",Addgene
human,60598,KCNK15,XM_017028003.1,TRCN0000414013,NM_022358.2-98s21c1,GTCCTGTGCACCCTGTGTTAC,pLKO_005,340,CDS,100,100,3.6,2.52,N,60598,KCNK15,CCGGGTCCTGTGCACCCTGTGTTACCTCGAGGTAACACAGGGTGCACAGGACTTTTTG,AATTCAAAAAGTCCTGTGCACCCTGTGTTACCTCGAGGTAACACAGGGTGCACAGGAC,n/a
human,60598,KCNK15,XM_017028003.1,TRCN0000048227,NM_003371.2-1179s1c1,CAAGTGAAACTGGAGGAATTT,pLKO.1,1345,3UTR,90,90,,,Y,7410,VAV2,CCGGCAAGTGAAACTGGAGGAATTTCTCGAGAAATTCCTCCAGTTTCACTTGTTTTTG,AATTCAAAAACAAGTGAAACTGGAGGAATTTCTCGAGAAATTCCTCCAGTTTCACTTG,n/a
human,60598,KCNK15,XM_017028003.1,TRCN0000253269,NM_181541.3-2959s21c1,TTCAGCTTGGTAGATTCAATT,pLKO_005,1898,3UTR,86,90,,,Y,232560,Caprin2,CCGGTTCAGCTTGGTAGATTCAATTCTCGAGAATTGAATCTACCAAGCTGAATTTTTG,AATTCAAAAATTCAGCTTGGTAGATTCAATTCTCGAGAATTGAATCTACCAAGCTGAA,n/a
human,60598,KCNK15,XM_017028003.1,TRCN0000014958,NM_000538.2-1089s1c1,CCTGTAAATGTATGTGTGCAT,pLKO.1,2108,3UTR,81,90,,,Y,5994,RFXAP,CCGGCCTGTAAATGTATGTGTGCATCTCGAGATGCACACATACATTTACAGGTTTTTG,AATTCAAAAACCTGTAAATGTATGTGTGCATCTCGAGATGCACACATACATTTACAGG,n/a
human,60598,KCNK15,XM_017028003.1,TRCN0000369665,NM_033142.1-504s21c1,ATCACCGTCAACACCACCATC,pLKO_005,568,CDS,90,89,,,Y,94027,CGB7,CCGGATCACCGTCAACACCACCATCCTCGAGGATGGTGGTGTTGACGGTGATTTTTTG,AATTCAAAAAATCACCGTCAACACCACCATCCTCGAGGATGGTGGTGTTGACGGTGAT,n/a
human,60598,KCNK15,XM_017028003.1,TRCN0000082825,NM_000737.2-503s1c1,CATCACCGTCAACACCACCAT,pLKO.1,567,CDS,90,89,,,Y,1082,CGB3,CCGGCATCACCGTCAACACCACCATCTCGAGATGGTGGTGTTGACGGTGATGTTTTTG,AATTCAAAAACATCACCGTCAACACCACCATCTCGAGATGGTGGTGTTGACGGTGATG,n/a
human,60598,KCNK15,XM_017028003.1,TRCN0000256847,NM_033183.2-512s21c1,TCACCGTCAACACCACCATCT,pLKO_005,569,CDS,85,89,,,Y,94115,CGB8,CCGGTCACCGTCAACACCACCATCTCTCGAGAGATGGTGGTGTTGACGGTGATTTTTG,AATTCAAAAATCACCGTCAACACCACCATCTCTCGAGAGATGGTGGTGTTGACGGTGA,n/a
human,60598,KCNK15,XM_017028003.1,TRCN0000276376,NM_022075.3-1236s21c1,CCTGCCTTCTTTGGCTATTAC,pLKO_005,928,3UTR,80,89,,,Y,29956,CERS2,CCGGCCTGCCTTCTTTGGCTATTACCTCGAGGTAATAGCCAAAGAAGGCAGGTTTTTG,AATTCAAAAACCTGCCTTCTTTGGCTATTACCTCGAGGTAATAGCCAAAGAAGGCAGG,n/a
human,60598,KCNK15,XM_017028003.1,TRCN0000090229,NM_144876.2-817s1c1,GCCTGGGTCAAATACAGTATT,pLKO.1,2243,3UTR,80,89,,,Y,226541,Klhl20,CCGGGCCTGGGTCAAATACAGTATTCTCGAGAATACTGTATTTGACCCAGGCTTTTTG,AATTCAAAAAGCCTGGGTCAAATACAGTATTCTCGAGAATACTGTATTTGACCCAGGC,n/a
human,60598,KCNK15,XM_017028003.1,TRCN0000172590,NM_152311.1-257s1c1,GCATGGATCACCAGTACGATT,pLKO.1,776,3UTR,80,89,,,Y,119467,CLRN3,CCGGGCATGGATCACCAGTACGATTCTCGAGAATCGTACTGGTGATCCATGCTTTTTG,AATTCAAAAAGCATGGATCACCAGTACGATTCTCGAGAATCGTACTGGTGATCCATGC,n/a
human,60598,KCNK15,XM_017028003.1,TRCN0000199445,NM_032019.4-1585s1c1,GCACCGCTGTTGCCCTGACAA,pLKO.1,622,CDS,81,85,,,Y,83933,HDAC10,CCGGGCACCGCTGTTGCCCTGACAACTCGAGTTGTCAGGGCAACAGCGGTGCTTTTTG,AATTCAAAAAGCACCGCTGTTGCCCTGACAACTCGAGTTGTCAGGGCAACAGCGGTGC,n/a
