Taxon,"Gene ID","Gene Symbol",Transcript,"Clone ID","Legacy Clone Name","Target Seq",Vector,"Match Position","Match Region","Match %","SDR Match %","Intrinsic Score","Adjusted Score","Matches Other Gene in Same Taxon?","Orig. Target Gene ID","Orig. Target Gene Symbol","Forward Oligo Sequence","Reverse Oligo Sequence",Addgene
mouse,246277,Csad,XR_001781534.1,TRCN0000106641,NM_144942.1-430s1c1,CCGGTTCTTCAACCAGCTCTT,pLKO.1,348,3UTR,100,100,4.05,5.67,N,246277,Csad,CCGGCCGGTTCTTCAACCAGCTCTTCTCGAGAAGAGCTGGTTGAAGAACCGGTTTTTG,AATTCAAAAACCGGTTCTTCAACCAGCTCTTCTCGAGAAGAGCTGGTTGAAGAACCGG,n/a
mouse,246277,Csad,XR_001781534.1,TRCN0000327564,NM_144942.4-429s21c1,CCGGTTCTTCAACCAGCTCTT,pLKO_005,348,3UTR,100,100,4.05,5.67,N,246277,Csad,CCGGCCGGTTCTTCAACCAGCTCTTCTCGAGAAGAGCTGGTTGAAGAACCGGTTTTTG,AATTCAAAAACCGGTTCTTCAACCAGCTCTTCTCGAGAAGAGCTGGTTGAAGAACCGG,n/a
mouse,246277,Csad,XR_001781534.1,TRCN0000106642,NM_144942.1-1595s1c1,CAGGCCGATATAGATTTCCTT,pLKO.1,1448,3UTR,100,100,3,4.2,N,246277,Csad,CCGGCAGGCCGATATAGATTTCCTTCTCGAGAAGGAAATCTATATCGGCCTGTTTTTG,AATTCAAAAACAGGCCGATATAGATTTCCTTCTCGAGAAGGAAATCTATATCGGCCTG,n/a
mouse,246277,Csad,XR_001781534.1,TRCN0000311598,NM_144942.4-936s21c1,GGATGCAATTGCCGATGTTTG,pLKO_005,855,3UTR,100,100,10.8,8.64,N,246277,Csad,CCGGGGATGCAATTGCCGATGTTTGCTCGAGCAAACATCGGCAATTGCATCCTTTTTG,AATTCAAAAAGGATGCAATTGCCGATGTTTGCTCGAGCAAACATCGGCAATTGCATCC,n/a
mouse,246277,Csad,XR_001781534.1,TRCN0000306695,NM_144942.4-1336s21c1,TACTTGGTGGAGGAGATTAAA,pLKO_005,1190,3UTR,100,100,15,10.5,N,246277,Csad,CCGGTACTTGGTGGAGGAGATTAAACTCGAGTTTAATCTCCTCCACCAAGTATTTTTG,AATTCAAAAATACTTGGTGGAGGAGATTAAACTCGAGTTTAATCTCCTCCACCAAGTA,n/a
mouse,246277,Csad,XR_001781534.1,TRCN0000106640,NM_144942.1-2046s1c1,GCTGGATATGAGTTTATGAAT,pLKO.1,1900,3UTR,100,100,5.625,3.9375,N,246277,Csad,CCGGGCTGGATATGAGTTTATGAATCTCGAGATTCATAAACTCATATCCAGCTTTTTG,AATTCAAAAAGCTGGATATGAGTTTATGAATCTCGAGATTCATAAACTCATATCCAGC,n/a
mouse,246277,Csad,XR_001781534.1,TRCN0000327499,NM_144942.4-2046s21c1,GCTGGATATGAGTTTATGAAT,pLKO_005,1900,3UTR,100,100,5.625,3.9375,N,246277,Csad,CCGGGCTGGATATGAGTTTATGAATCTCGAGATTCATAAACTCATATCCAGCTTTTTG,AATTCAAAAAGCTGGATATGAGTTTATGAATCTCGAGATTCATAAACTCATATCCAGC,n/a
mouse,246277,Csad,XR_001781534.1,TRCN0000106643,NM_144942.1-1183s1c1,GCAAGACAAGTTCTACGATGT,pLKO.1,1036,3UTR,100,100,4.05,2.835,N,246277,Csad,CCGGGCAAGACAAGTTCTACGATGTCTCGAGACATCGTAGAACTTGTCTTGCTTTTTG,AATTCAAAAAGCAAGACAAGTTCTACGATGTCTCGAGACATCGTAGAACTTGTCTTGC,n/a
mouse,246277,Csad,XR_001781534.1,TRCN0000106644,NM_144942.1-1181s1c1,CAGCAAGACAAGTTCTACGAT,pLKO.1,1034,3UTR,100,100,3,2.1,N,246277,Csad,CCGGCAGCAAGACAAGTTCTACGATCTCGAGATCGTAGAACTTGTCTTGCTGTTTTTG,AATTCAAAAACAGCAAGACAAGTTCTACGATCTCGAGATCGTAGAACTTGTCTTGCTG,n/a
mouse,246277,Csad,XR_001781534.1,TRCN0000327565,NM_144942.4-1180s21c1,CAGCAAGACAAGTTCTACGAT,pLKO_005,1034,3UTR,100,100,3,2.1,N,246277,Csad,CCGGCAGCAAGACAAGTTCTACGATCTCGAGATCGTAGAACTTGTCTTGCTGTTTTTG,AATTCAAAAACAGCAAGACAAGTTCTACGATCTCGAGATCGTAGAACTTGTCTTGCTG,n/a
mouse,246277,Csad,XR_001781534.1,TRCN0000078526,NM_015989.3-1329s1c1,GCAGGACAAGTTCTACGATGT,pLKO.1,1036,3UTR,95,95,,,N,51380,CSAD,CCGGGCAGGACAAGTTCTACGATGTCTCGAGACATCGTAGAACTTGTCCTGCTTTTTG,AATTCAAAAAGCAGGACAAGTTCTACGATGTCTCGAGACATCGTAGAACTTGTCCTGC,n/a
mouse,246277,Csad,XR_001781534.1,TRCN0000108497,XM_483945.1-384s1c1,CCCGTGTTTGTTCTCATGGAA,pLKO.1,451,3UTR,95,95,,,Y,382407,Gad1-ps,CCGGCCCGTGTTTGTTCTCATGGAACTCGAGTTCCATGAGAACAAACACGGGTTTTTG,AATTCAAAAACCCGTGTTTGTTCTCATGGAACTCGAGTTCCATGAGAACAAACACGGG,n/a
mouse,246277,Csad,XR_001781534.1,TRCN0000078527,NM_015989.3-653s1c1,CCAGCCAGTACACATATGAAA,pLKO.1,425,3UTR,90,95,,,Y,51380,CSAD,CCGGCCAGCCAGTACACATATGAAACTCGAGTTTCATATGTGTACTGGCTGGTTTTTG,AATTCAAAAACCAGCCAGTACACATATGAAACTCGAGTTTCATATGTGTACTGGCTGG,n/a
mouse,246277,Csad,XR_001781534.1,TRCN0000106407,NM_001002787.1-790s1c1,GCTGATGTTTGCCAGCAACAA,pLKO.1,865,3UTR,85,89,,,Y,442829,Ccin,CCGGGCTGATGTTTGCCAGCAACAACTCGAGTTGTTGCTGGCAAACATCAGCTTTTTG,AATTCAAAAAGCTGATGTTTGCCAGCAACAACTCGAGTTGTTGCTGGCAAACATCAGC,n/a
mouse,246277,Csad,XR_001781534.1,TRCN0000583897,,TGCTCCTGCTCTTCTTCTGTG,pLKO_005,959,3UTR,85,89,,,Y,386746,MRGPRG,CCGGTGCTCCTGCTCTTCTTCTGTGCTCGAGCACAGAAGAAGAGCAGGAGCATTTTTG,AATTCAAAAATGCTCCTGCTCTTCTTCTGTGCTCGAGCACAGAAGAAGAGCAGGAGCA,n/a
mouse,246277,Csad,XR_001781534.1,TRCN0000130867,NM_017852.1-3163s1c1,GAACTCAATAAGCTGCTGGAA,pLKO.1,238,3UTR,85,89,,,Y,55655,NLRP2,CCGGGAACTCAATAAGCTGCTGGAACTCGAGTTCCAGCAGCTTATTGAGTTCTTTTTG,AATTCAAAAAGAACTCAATAAGCTGCTGGAACTCGAGTTCCAGCAGCTTATTGAGTTC,n/a
mouse,246277,Csad,XR_001781534.1,TRCN0000108962,NM_024184.1-246s1c1,CCTGGAGTGGAAGATCATTTA,pLKO.1,756,3UTR,80,89,,,Y,66929,Asf1b,CCGGCCTGGAGTGGAAGATCATTTACTCGAGTAAATGATCTTCCACTCCAGGTTTTTG,AATTCAAAAACCTGGAGTGGAAGATCATTTACTCGAGTAAATGATCTTCCACTCCAGG,n/a
mouse,246277,Csad,XR_001781534.1,TRCN0000055702,NM_023932.2-662s1c1,CCAGGGCTTTGCTCTCAACTT,pLKO.1,1168,3UTR,80,89,,,Y,65989,DLK2,CCGGCCAGGGCTTTGCTCTCAACTTCTCGAGAAGTTGAGAGCAAAGCCCTGGTTTTTG,AATTCAAAAACCAGGGCTTTGCTCTCAACTTCTCGAGAAGTTGAGAGCAAAGCCCTGG,n/a
mouse,246277,Csad,XR_001781534.1,TRCN0000190988,NM_171824.1-80s1c1,CCAACATGTATGCCAGGAAGT,pLKO.1,551,3UTR,80,89,,,Y,209966,Pgbd5,CCGGCCAACATGTATGCCAGGAAGTCTCGAGACTTCCTGGCATACATGTTGGTTTTTG,AATTCAAAAACCAACATGTATGCCAGGAAGTCTCGAGACTTCCTGGCATACATGTTGG,n/a
mouse,246277,Csad,XR_001781534.1,TRCN0000047308,NM_006064.3-913s1c1,CGGGACAACATCTTCCGAAAT,pLKO.1,1403,3UTR,80,89,,,Y,10325,RRAGB,CCGGCGGGACAACATCTTCCGAAATCTCGAGATTTCGGAAGATGTTGTCCCGTTTTTG,AATTCAAAAACGGGACAACATCTTCCGAAATCTCGAGATTTCGGAAGATGTTGTCCCG,n/a
mouse,246277,Csad,XR_001781534.1,TRCN0000193949,NM_013721.2-564s1c1,CTACTGCATCATCAAGGGAAA,pLKO.1,660,3UTR,80,89,,,Y,27176,Rpl7a,CCGGCTACTGCATCATCAAGGGAAACTCGAGTTTCCCTTGATGATGCAGTAGTTTTTG,AATTCAAAAACTACTGCATCATCAAGGGAAACTCGAGTTTCCCTTGATGATGCAGTAG,n/a
mouse,246277,Csad,XR_001781534.1,TRCN0000168083,NM_152325.1-596s1c1,CCTGAGCTTCAAGATTTCAGT,pLKO.1,64,3UTR,80,89,,,Y,122046,TEX26,CCGGCCTGAGCTTCAAGATTTCAGTCTCGAGACTGAAATCTTGAAGCTCAGGTTTTTG,AATTCAAAAACCTGAGCTTCAAGATTTCAGTCTCGAGACTGAAATCTTGAAGCTCAGG,n/a
mouse,246277,Csad,XR_001781534.1,TRCN0000282227,NM_001098376.2-1502s21c1,GACCTGGAGGCAGATCAATAC,pLKO_005,754,3UTR,78,86,,,Y,653619,PRAMEF15,CCGGGACCTGGAGGCAGATCAATACCTCGAGGTATTGATCTGCCTCCAGGTCTTTTTG,AATTCAAAAAGACCTGGAGGCAGATCAATACCTCGAGGTATTGATCTGCCTCCAGGTC,n/a
mouse,246277,Csad,XR_001781534.1,TRCN0000072177,NM_053157.1-274s1c1,TGTAAGGATTTGAGTGGTAAT,pLKO.1,1215,3UTR,86,85,,,Y,94043,Tm2d1,CCGGTGTAAGGATTTGAGTGGTAATCTCGAGATTACCACTCAAATCCTTACATTTTTG,AATTCAAAAATGTAAGGATTTGAGTGGTAATCTCGAGATTACCACTCAAATCCTTACA,n/a
mouse,246277,Csad,XR_001781534.1,TRCN0000323463,NM_053157.2-300s21c1,TGTAAGGATTTGAGTGGTAAT,pLKO_005,1215,3UTR,86,85,,,Y,94043,Tm2d1,CCGGTGTAAGGATTTGAGTGGTAATCTCGAGATTACCACTCAAATCCTTACATTTTTG,AATTCAAAAATGTAAGGATTTGAGTGGTAATCTCGAGATTACCACTCAAATCCTTACA,n/a
mouse,246277,Csad,XR_001781534.1,TRCN0000123767,NM_027911.2-1332s1c1,CACAACCCTTACTACCACCAT,pLKO.1,1706,3UTR,86,85,,,Y,71766,Raver1,CCGGCACAACCCTTACTACCACCATCTCGAGATGGTGGTAGTAAGGGTTGTGTTTTTG,AATTCAAAAACACAACCCTTACTACCACCATCTCGAGATGGTGGTAGTAAGGGTTGTG,n/a
mouse,246277,Csad,XR_001781534.1,TRCN0000287191,NM_027911.3-1333s21c1,CACAACCCTTACTACCACCAT,pLKO_005,1706,3UTR,86,85,,,Y,71766,Raver1,CCGGCACAACCCTTACTACCACCATCTCGAGATGGTGGTAGTAAGGGTTGTGTTTTTG,AATTCAAAAACACAACCCTTACTACCACCATCTCGAGATGGTGGTAGTAAGGGTTGTG,n/a
mouse,246277,Csad,XR_001781534.1,TRCN0000068830,NM_172780.1-1396s1c1,CCCTTGTCTCTCTTACTTAAT,pLKO.1,628,3UTR,81,85,,,Y,236794,Slc9a6,CCGGCCCTTGTCTCTCTTACTTAATCTCGAGATTAAGTAAGAGAGACAAGGGTTTTTG,AATTCAAAAACCCTTGTCTCTCTTACTTAATCTCGAGATTAAGTAAGAGAGACAAGGG,n/a
