Taxon,"Gene ID","Gene Symbol",Transcript,"Clone ID","Legacy Clone Name","Target Seq",Vector,"Match Position","Match Region","Match %","SDR Match %","Intrinsic Score","Adjusted Score","Matches Other Gene in Same Taxon?","Orig. Target Gene ID","Orig. Target Gene Symbol","Forward Oligo Sequence","Reverse Oligo Sequence",Addgene
mouse,52666,Arhgef25,XR_871718.2,TRCN0000340839,NM_028027.2-919s21c1,GTGGTGTACTGCCAGAATAAA,pLKO_005,985,3UTR,100,100,15,21,N,52666,Arhgef25,CCGGGTGGTGTACTGCCAGAATAAACTCGAGTTTATTCTGGCAGTACACCACTTTTTG,AATTCAAAAAGTGGTGTACTGCCAGAATAAACTCGAGTTTATTCTGGCAGTACACCAC,n/a
mouse,52666,Arhgef25,XR_871718.2,TRCN0000120373,NM_028027.1-1577s1c1,CGTGACTTTCTCAACGCATTA,pLKO.1,1664,3UTR,100,100,10.8,15.12,N,52666,Arhgef25,CCGGCGTGACTTTCTCAACGCATTACTCGAGTAATGCGTTGAGAAAGTCACGTTTTTG,AATTCAAAAACGTGACTTTCTCAACGCATTACTCGAGTAATGCGTTGAGAAAGTCACG,n/a
mouse,52666,Arhgef25,XR_871718.2,TRCN0000340838,NM_028027.2-1577s21c1,GTGACTTTCTCAACGCATTAC,pLKO_005,1665,3UTR,100,100,10.8,15.12,N,52666,Arhgef25,CCGGGTGACTTTCTCAACGCATTACCTCGAGGTAATGCGTTGAGAAAGTCACTTTTTG,AATTCAAAAAGTGACTTTCTCAACGCATTACCTCGAGGTAATGCGTTGAGAAAGTCAC,n/a
mouse,52666,Arhgef25,XR_871718.2,TRCN0000340772,NM_028027.2-1158s21c1,ACCTAAGCGATGCAATGATAT,pLKO_005,1224,3UTR,100,100,13.2,10.56,N,52666,Arhgef25,CCGGACCTAAGCGATGCAATGATATCTCGAGATATCATTGCATCGCTTAGGTTTTTTG,AATTCAAAAAACCTAAGCGATGCAATGATATCTCGAGATATCATTGCATCGCTTAGGT,n/a
mouse,52666,Arhgef25,XR_871718.2,TRCN0000120374,NM_028027.1-852s1c1,AGTGTTTGAAAGATCCCGATT,pLKO.1,917,3UTR,100,100,4.05,3.24,N,52666,Arhgef25,CCGGAGTGTTTGAAAGATCCCGATTCTCGAGAATCGGGATCTTTCAAACACTTTTTTG,AATTCAAAAAAGTGTTTGAAAGATCCCGATTCTCGAGAATCGGGATCTTTCAAACACT,n/a
mouse,52666,Arhgef25,XR_871718.2,TRCN0000340840,NM_028027.2-1311s21c1,TGTCTTCCTGTTCGAGCAAAT,pLKO_005,1399,3UTR,100,100,10.8,7.56,N,52666,Arhgef25,CCGGTGTCTTCCTGTTCGAGCAAATCTCGAGATTTGCTCGAACAGGAAGACATTTTTG,AATTCAAAAATGTCTTCCTGTTCGAGCAAATCTCGAGATTTGCTCGAACAGGAAGACA,n/a
mouse,52666,Arhgef25,XR_871718.2,TRCN0000120375,NM_028027.1-500s1c1,CCAACTTTAACCACAGGACAA,pLKO.1,565,3UTR,100,100,4.05,2.835,N,52666,Arhgef25,CCGGCCAACTTTAACCACAGGACAACTCGAGTTGTCCTGTGGTTAAAGTTGGTTTTTG,AATTCAAAAACCAACTTTAACCACAGGACAACTCGAGTTGTCCTGTGGTTAAAGTTGG,n/a
mouse,52666,Arhgef25,XR_871718.2,TRCN0000120376,NM_028027.1-1592s1c1,GCATTACAGTCACCCATTGAA,pLKO.1,1679,3UTR,100,100,5.625,3.375,N,52666,Arhgef25,CCGGGCATTACAGTCACCCATTGAACTCGAGTTCAATGGGTGACTGTAATGCTTTTTG,AATTCAAAAAGCATTACAGTCACCCATTGAACTCGAGTTCAATGGGTGACTGTAATGC,n/a
mouse,52666,Arhgef25,XR_871718.2,TRCN0000230916,NM_001111270.1-795s21c1,ATGAGTGGCACCGAGACTATT,pLKO_005,878,3UTR,95,100,13.2,10.56,N,115557,ARHGEF25,CCGGATGAGTGGCACCGAGACTATTCTCGAGAATAGTCTCGGTGCCACTCATTTTTTG,AATTCAAAAAATGAGTGGCACCGAGACTATTCTCGAGAATAGTCTCGGTGCCACTCAT,n/a
mouse,52666,Arhgef25,XR_871718.2,TRCN0000021610,NM_133483.1-481s1c1,GCTCTGGAAAGGAGTATGTAT,pLKO.1,706,3UTR,95,100,5.625,3.9375,N,115557,ARHGEF25,CCGGGCTCTGGAAAGGAGTATGTATCTCGAGATACATACTCCTTTCCAGAGCTTTTTG,AATTCAAAAAGCTCTGGAAAGGAGTATGTATCTCGAGATACATACTCCTTTCCAGAGC,n/a
mouse,52666,Arhgef25,XR_871718.2,TRCN0000230914,NM_001111270.1-240s21c1,CTCTGCAGCCCGAATCCTATT,pLKO_005,323,3UTR,95,95,,,N,115557,ARHGEF25,CCGGCTCTGCAGCCCGAATCCTATTCTCGAGAATAGGATTCGGGCTGCAGAGTTTTTG,AATTCAAAAACTCTGCAGCCCGAATCCTATTCTCGAGAATAGGATTCGGGCTGCAGAG,n/a
mouse,52666,Arhgef25,XR_871718.2,TRCN0000217997,NM_001111270.1-764s21c1,AGGATTGTGTTTGGGAATATC,pLKO_005,847,3UTR,90,95,,,N,115557,ARHGEF25,CCGGAGGATTGTGTTTGGGAATATCCTCGAGGATATTCCCAAACACAATCCTTTTTTG,AATTCAAAAAAGGATTGTGTTTGGGAATATCCTCGAGGATATTCCCAAACACAATCCT,n/a
mouse,52666,Arhgef25,XR_871718.2,TRCN0000100409,NM_172601.1-659s1c1,GCAGTCAATTACCTCCTCAGT,pLKO.1,1083,3UTR,86,90,,,Y,76338,Rab2b,CCGGGCAGTCAATTACCTCCTCAGTCTCGAGACTGAGGAGGTAATTGACTGCTTTTTG,AATTCAAAAAGCAGTCAATTACCTCCTCAGTCTCGAGACTGAGGAGGTAATTGACTGC,n/a
mouse,52666,Arhgef25,XR_871718.2,TRCN0000287555,NM_172601.2-658s21c1,GCAGTCAATTACCTCCTCAGT,pLKO_005,1083,3UTR,86,90,,,Y,76338,Rab2b,CCGGGCAGTCAATTACCTCCTCAGTCTCGAGACTGAGGAGGTAATTGACTGCTTTTTG,AATTCAAAAAGCAGTCAATTACCTCCTCAGTCTCGAGACTGAGGAGGTAATTGACTGC,n/a
mouse,52666,Arhgef25,XR_871718.2,TRCN0000001973,NM_152619.x-991s1c1,GCAAATCACCAGCTTCAGTTA,pLKO.1,1414,3UTR,85,89,,,Y,166614,DCLK2,CCGGGCAAATCACCAGCTTCAGTTACTCGAGTAACTGAAGCTGGTGATTTGCTTTTTG,AATTCAAAAAGCAAATCACCAGCTTCAGTTACTCGAGTAACTGAAGCTGGTGATTTGC,n/a
mouse,52666,Arhgef25,XR_871718.2,TRCN0000095180,NM_028986.1-1905s1c1,CCAAGAATGATGAAGGGCATA,pLKO.1,677,3UTR,85,89,,,Y,74533,Gzf1,CCGGCCAAGAATGATGAAGGGCATACTCGAGTATGCCCTTCATCATTCTTGGTTTTTG,AATTCAAAAACCAAGAATGATGAAGGGCATACTCGAGTATGCCCTTCATCATTCTTGG,n/a
mouse,52666,Arhgef25,XR_871718.2,TRCN0000072192,clonetechGfp_477s1c1,GAACGGCATCAAGGTGAACTT,pLKO.1,1486,3UTR,85,89,,,Y,GFP,GFP,CCGGGAACGGCATCAAGGTGAACTTCTCGAGAAGTTCACCTTGATGCCGTTCTTTTTG,AATTCAAAAAGAACGGCATCAAGGTGAACTTCTCGAGAAGTTCACCTTGATGCCGTTC,n/a
mouse,52666,Arhgef25,XR_871718.2,TRCN0000231760,clonetechGfp_477s21c1,GAACGGCATCAAGGTGAACTT,pLKO_005,1486,3UTR,85,89,,,Y,GFP,GFP,CCGGGAACGGCATCAAGGTGAACTTCTCGAGAAGTTCACCTTGATGCCGTTCTTTTTG,AATTCAAAAAGAACGGCATCAAGGTGAACTTCTCGAGAAGTTCACCTTGATGCCGTTC,n/a
mouse,52666,Arhgef25,XR_871718.2,TRCN0000149895,NM_181481.1-661s1c1,GTTCGCCCAAATCATCATCAT,pLKO.1,1408,3UTR,85,89,,,Y,753,LDLRAD4,CCGGGTTCGCCCAAATCATCATCATCTCGAGATGATGATGATTTGGGCGAACTTTTTG,AATTCAAAAAGTTCGCCCAAATCATCATCATCTCGAGATGATGATGATTTGGGCGAAC,n/a
mouse,52666,Arhgef25,XR_871718.2,TRCN0000173012,NM_030628.1-431s1c1,GCAGGTGCTGTCTGAGTTTAT,pLKO.1,1017,3UTR,80,89,,,Y,80789,INTS5,CCGGGCAGGTGCTGTCTGAGTTTATCTCGAGATAAACTCAGACAGCACCTGCTTTTTG,AATTCAAAAAGCAGGTGCTGTCTGAGTTTATCTCGAGATAAACTCAGACAGCACCTGC,n/a
mouse,52666,Arhgef25,XR_871718.2,TRCN0000380291,NM_020857.2-1688s21c1,AGAGCTACTTTGAGGAGATTG,pLKO_005,1040,3UTR,80,89,,,Y,57617,VPS18,CCGGAGAGCTACTTTGAGGAGATTGCTCGAGCAATCTCCTCAAAGTAGCTCTTTTTTG,AATTCAAAAAAGAGCTACTTTGAGGAGATTGCTCGAGCAATCTCCTCAAAGTAGCTCT,n/a
mouse,52666,Arhgef25,XR_871718.2,TRCN0000124001,NM_028059.2-459s1c1,CCCATTGCTATACCAGAGAAT,pLKO.1,1691,3UTR,80,89,,,Y,72020,Zfp654,CCGGCCCATTGCTATACCAGAGAATCTCGAGATTCTCTGGTATAGCAATGGGTTTTTG,AATTCAAAAACCCATTGCTATACCAGAGAATCTCGAGATTCTCTGGTATAGCAATGGG,n/a
mouse,52666,Arhgef25,XR_871718.2,TRCN0000267614,NM_001039678.1-54s21c1,GGATGTGTTTGGGAACATTGT,pLKO_005,849,3UTR,80,89,,,Y,231903,Urad,CCGGGGATGTGTTTGGGAACATTGTCTCGAGACAATGTTCCCAAACACATCCTTTTTG,AATTCAAAAAGGATGTGTTTGGGAACATTGTCTCGAGACAATGTTCCCAAACACATCC,n/a
mouse,52666,Arhgef25,XR_871718.2,TRCN0000082463,XM_499394.1-698s1c1,CAGAGCATTGGCTGTCAGAAA,pLKO.1,1013,3UTR,80,89,,,Y,5575,PRKAR1B,CCGGCAGAGCATTGGCTGTCAGAAACTCGAGTTTCTGACAGCCAATGCTCTGTTTTTG,AATTCAAAAACAGAGCATTGGCTGTCAGAAACTCGAGTTTCTGACAGCCAATGCTCTG,n/a
mouse,52666,Arhgef25,XR_871718.2,TRCN0000065881,NM_010505.1-340s1c1,CAGCAGCTCAATGACCTCAAA,pLKO.1,1081,3UTR,80,89,,,Y,15968,Ifna5,CCGGCAGCAGCTCAATGACCTCAAACTCGAGTTTGAGGTCATTGAGCTGCTGTTTTTG,AATTCAAAAACAGCAGCTCAATGACCTCAAACTCGAGTTTGAGGTCATTGAGCTGCTG,n/a
mouse,52666,Arhgef25,XR_871718.2,TRCN0000136005,NM_174926.1-673s1c1,GAGGAAGAGCATCAAGAAGTA,pLKO.1,685,3UTR,80,89,,,Y,219902,TLCD5,CCGGGAGGAAGAGCATCAAGAAGTACTCGAGTACTTCTTGATGCTCTTCCTCTTTTTG,AATTCAAAAAGAGGAAGAGCATCAAGAAGTACTCGAGTACTTCTTGATGCTCTTCCTC,n/a
mouse,52666,Arhgef25,XR_871718.2,TRCN0000583881,,TTACTGGCTGCCATGGCTTAT,pLKO_005,792,3UTR,81,85,,,Y,504191,OR9G9,CCGGTTACTGGCTGCCATGGCTTATCTCGAGATAAGCCATGGCAGCCAGTAATTTTTG,AATTCAAAAATTACTGGCTGCCATGGCTTATCTCGAGATAAGCCATGGCAGCCAGTAA,n/a
mouse,52666,Arhgef25,XR_871718.2,TRCN0000194505,NM_026557.2-983s1c1,GAATACCAGAACGTGACTGTT,pLKO.1,1697,3UTR,77,85,,,Y,68098,Rchy1,CCGGGAATACCAGAACGTGACTGTTCTCGAGAACAGTCACGTTCTGGTATTCTTTTTG,AATTCAAAAAGAATACCAGAACGTGACTGTTCTCGAGAACAGTCACGTTCTGGTATTC,n/a
mouse,52666,Arhgef25,XR_871718.2,TRCN0000344448,NM_001145668.1-525s21c1,GGACACATTCTGGATACAATT,pLKO_005,1333,3UTR,77,85,,,Y,399697,CTXN2,CCGGGGACACATTCTGGATACAATTCTCGAGAATTGTATCCAGAATGTGTCCTTTTTG,AATTCAAAAAGGACACATTCTGGATACAATTCTCGAGAATTGTATCCAGAATGTGTCC,n/a
