Taxon,"Gene ID","Gene Symbol",Transcript,"Clone ID","Legacy Clone Name","Target Seq",Vector,"Match Position","Match Region","Match %","SDR Match %","Intrinsic Score","Adjusted Score","Matches Other Gene in Same Taxon?","Orig. Target Gene ID","Orig. Target Gene Symbol","Forward Oligo Sequence","Reverse Oligo Sequence",Addgene
human,109729141,TDRKH-AS1,NR_146292.1,TRCN0000155836,NM_198582.1-3275s1c1,CCCAAAGTGCTGGGATTACAA,pLKO.1,733,3UTR,95,100,5.625,2.8125,Y,377007,KLHL30,CCGGCCCAAAGTGCTGGGATTACAACTCGAGTTGTAATCCCAGCACTTTGGGTTTTTG,AATTCAAAAACCCAAAGTGCTGGGATTACAACTCGAGTTGTAATCCCAGCACTTTGGG,n/a
human,109729141,TDRKH-AS1,NR_146292.1,TRCN0000141025,NM_152361.1-835s1c1,CCCAAAGTGCTGGGATTACTT,pLKO.1,733,3UTR,90,100,5.625,2.8125,Y,126272,EID2B,CCGGCCCAAAGTGCTGGGATTACTTCTCGAGAAGTAATCCCAGCACTTTGGGTTTTTG,AATTCAAAAACCCAAAGTGCTGGGATTACTTCTCGAGAAGTAATCCCAGCACTTTGGG,n/a
human,109729141,TDRKH-AS1,NR_146292.1,TRCN0000204533,NM_001013675.1-1987s1c1,CCTCCCAAAGTGCTGGAATTA,pLKO.1,730,3UTR,95,95,,,Y,400891,LRRC74B,CCGGCCTCCCAAAGTGCTGGAATTACTCGAGTAATTCCAGCACTTTGGGAGGTTTTTG,AATTCAAAAACCTCCCAAAGTGCTGGAATTACTCGAGTAATTCCAGCACTTTGGGAGG,n/a
human,109729141,TDRKH-AS1,NR_146292.1,TRCN0000072628,NM_016065.3-1636s1c1,CCTCCCAAAGTGCTAGGATTA,pLKO.1,730,3UTR,95,95,,,Y,51021,MRPS16,CCGGCCTCCCAAAGTGCTAGGATTACTCGAGTAATCCTAGCACTTTGGGAGGTTTTTG,AATTCAAAAACCTCCCAAAGTGCTAGGATTACTCGAGTAATCCTAGCACTTTGGGAGG,n/a
human,109729141,TDRKH-AS1,NR_146292.1,TRCN0000164801,NM_016534.2-1646s1c1,CCTCCCAAAGTACTGGGATTA,pLKO.1,730,3UTR,95,95,,,Y,51275,MAPKAPK5-AS1,CCGGCCTCCCAAAGTACTGGGATTACTCGAGTAATCCCAGTACTTTGGGAGGTTTTTG,AATTCAAAAACCTCCCAAAGTACTGGGATTACTCGAGTAATCCCAGTACTTTGGGAGG,n/a
human,109729141,TDRKH-AS1,NR_146292.1,TRCN0000008902,NM_016540.2-2291s1c1,CCTCCCAAAGTGTTGGGATTA,pLKO.1,730,3UTR,95,95,,,Y,10888,GPR83,CCGGCCTCCCAAAGTGTTGGGATTACTCGAGTAATCCCAACACTTTGGGAGGTTTTTG,AATTCAAAAACCTCCCAAAGTGTTGGGATTACTCGAGTAATCCCAACACTTTGGGAGG,n/a
human,109729141,TDRKH-AS1,NR_146292.1,TRCN0000156315,NM_020702.1-3633s1c1,CCTCCCAAAGTGTTGGGATTA,pLKO.1,730,3UTR,95,95,,,Y,57462,MYORG,CCGGCCTCCCAAAGTGTTGGGATTACTCGAGTAATCCCAACACTTTGGGAGGTTTTTG,AATTCAAAAACCTCCCAAAGTGTTGGGATTACTCGAGTAATCCCAACACTTTGGGAGG,n/a
human,109729141,TDRKH-AS1,NR_146292.1,TRCN0000116227,NM_024930.1-2895s1c1,CCTCCCAAAGTTCTGGGATTA,pLKO.1,730,3UTR,95,95,,,Y,79993,ELOVL7,CCGGCCTCCCAAAGTTCTGGGATTACTCGAGTAATCCCAGAACTTTGGGAGGTTTTTG,AATTCAAAAACCTCCCAAAGTTCTGGGATTACTCGAGTAATCCCAGAACTTTGGGAGG,n/a
human,109729141,TDRKH-AS1,NR_146292.1,TRCN0000164591,NM_003281.3-2102s1c1,CCTCCCAAAGTTCTGGGATTA,pLKO.1,730,3UTR,95,95,,,Y,7135,TNNI1,CCGGCCTCCCAAAGTTCTGGGATTACTCGAGTAATCCCAGAACTTTGGGAGGTTTTTG,AATTCAAAAACCTCCCAAAGTTCTGGGATTACTCGAGTAATCCCAGAACTTTGGGAGG,n/a
human,109729141,TDRKH-AS1,NR_146292.1,TRCN0000040213,NM_000618.2-6169s1c1,CCTCCCAAATTGCTGGGATTA,pLKO.1,730,3UTR,95,95,,,Y,3479,IGF1,CCGGCCTCCCAAATTGCTGGGATTACTCGAGTAATCCCAGCAATTTGGGAGGTTTTTG,AATTCAAAAACCTCCCAAATTGCTGGGATTACTCGAGTAATCCCAGCAATTTGGGAGG,n/a
human,109729141,TDRKH-AS1,NR_146292.1,TRCN0000162795,NM_017842.1-1079s1c1,CTTCCAAAGTGCTGGGATTAT,pLKO.1,731,3UTR,90,95,,,Y,55652,SLC48A1,CCGGCTTCCAAAGTGCTGGGATTATCTCGAGATAATCCCAGCACTTTGGAAGTTTTTG,AATTCAAAAACTTCCAAAGTGCTGGGATTATCTCGAGATAATCCCAGCACTTTGGAAG,n/a
human,109729141,TDRKH-AS1,NR_146292.1,TRCN0000140657,NM_012099.1-2957s1c1,CCTCCCAAAGTGCTAGGATAA,pLKO.1,730,3UTR,90,95,,,Y,10849,CD3EAP,CCGGCCTCCCAAAGTGCTAGGATAACTCGAGTTATCCTAGCACTTTGGGAGGTTTTTG,AATTCAAAAACCTCCCAAAGTGCTAGGATAACTCGAGTTATCCTAGCACTTTGGGAGG,n/a
human,109729141,TDRKH-AS1,NR_146292.1,TRCN0000047783,NM_017516.1-1624s1c1,GCCTCCAAAGTGCTGGAATTA,pLKO.1,729,3UTR,90,90,,,Y,54734,RAB39A,CCGGGCCTCCAAAGTGCTGGAATTACTCGAGTAATTCCAGCACTTTGGAGGCTTTTTG,AATTCAAAAAGCCTCCAAAGTGCTGGAATTACTCGAGTAATTCCAGCACTTTGGAGGC,n/a
human,109729141,TDRKH-AS1,NR_146292.1,TRCN0000198922,NM_178897.2-2085s1c1,GCTTCCCAAATGCTGGGATTA,pLKO.1,729,3UTR,90,90,,,Y,100929,Tyw1,CCGGGCTTCCCAAATGCTGGGATTACTCGAGTAATCCCAGCATTTGGGAAGCTTTTTG,AATTCAAAAAGCTTCCCAAATGCTGGGATTACTCGAGTAATCCCAGCATTTGGGAAGC,n/a
human,109729141,TDRKH-AS1,NR_146292.1,TRCN0000091448,NM_013513.1-2495s1c1,CCTCCCAAGTACTGGGATTAA,pLKO.1,730,3UTR,86,90,,,Y,13828,Epb42,CCGGCCTCCCAAGTACTGGGATTAACTCGAGTTAATCCCAGTACTTGGGAGGTTTTTG,AATTCAAAAACCTCCCAAGTACTGGGATTAACTCGAGTTAATCCCAGTACTTGGGAGG,n/a
human,109729141,TDRKH-AS1,NR_146292.1,TRCN0000156872,NM_058219.2-1204s1c1,GCAACCACACCTGGCTAATTT,pLKO.1,626,3UTR,90,89,,,Y,118460,EXOSC6,CCGGGCAACCACACCTGGCTAATTTCTCGAGAAATTAGCCAGGTGTGGTTGCTTTTTG,AATTCAAAAAGCAACCACACCTGGCTAATTTCTCGAGAAATTAGCCAGGTGTGGTTGC,n/a
human,109729141,TDRKH-AS1,NR_146292.1,TRCN0000150833,NM_207309.1-2994s1c1,GCCTGGCTAATTCTTTGTATT,pLKO.1,634,3UTR,90,89,,,Y,91373,UAP1L1,CCGGGCCTGGCTAATTCTTTGTATTCTCGAGAATACAAAGAATTAGCCAGGCTTTTTG,AATTCAAAAAGCCTGGCTAATTCTTTGTATTCTCGAGAATACAAAGAATTAGCCAGGC,n/a
human,109729141,TDRKH-AS1,NR_146292.1,TRCN0000078633,NM_032214.2-1896s1c1,CCTCCAGAATAGCTGGGATTA,pLKO.1,596,3UTR,90,89,,,Y,84174,SLA2,CCGGCCTCCAGAATAGCTGGGATTACTCGAGTAATCCCAGCTATTCTGGAGGTTTTTG,AATTCAAAAACCTCCAGAATAGCTGGGATTACTCGAGTAATCCCAGCTATTCTGGAGG,n/a
human,109729141,TDRKH-AS1,NR_146292.1,TRCN0000042823,NM_024055.2-973s1c1,CCTCACAAAGTGCTAGGATTA,pLKO.1,730,3UTR,90,89,,,Y,64924,SLC30A5,CCGGCCTCACAAAGTGCTAGGATTACTCGAGTAATCCTAGCACTTTGTGAGGTTTTTG,AATTCAAAAACCTCACAAAGTGCTAGGATTACTCGAGTAATCCTAGCACTTTGTGAGG,n/a
human,109729141,TDRKH-AS1,NR_146292.1,TRCN0000082462,XM_371492.2-638s1c1,CCTCCCAAAGTGCCAGGATTA,pLKO.1,730,3UTR,90,89,,,Y,388949,LOC388949,CCGGCCTCCCAAAGTGCCAGGATTACTCGAGTAATCCTGGCACTTTGGGAGGTTTTTG,AATTCAAAAACCTCCCAAAGTGCCAGGATTACTCGAGTAATCCTGGCACTTTGGGAGG,n/a
human,109729141,TDRKH-AS1,NR_146292.1,TRCN0000165736,NM_175901.3-1946s1c1,CCTCCCTAAGTGTTGGGATTA,pLKO.1,730,3UTR,90,89,,,Y,283932,FBXL19-AS1,CCGGCCTCCCTAAGTGTTGGGATTACTCGAGTAATCCCAACACTTAGGGAGGTTTTTG,AATTCAAAAACCTCCCTAAGTGTTGGGATTACTCGAGTAATCCCAACACTTAGGGAGG,n/a
human,109729141,TDRKH-AS1,NR_146292.1,TRCN0000166560,NM_207497.1-412s1c1,CCTCCGAAAGTGCTAGGATTA,pLKO.1,730,3UTR,90,89,,,Y,401253,LINC00336,CCGGCCTCCGAAAGTGCTAGGATTACTCGAGTAATCCTAGCACTTTCGGAGGTTTTTG,AATTCAAAAACCTCCGAAAGTGCTAGGATTACTCGAGTAATCCTAGCACTTTCGGAGG,n/a
human,109729141,TDRKH-AS1,NR_146292.1,TRCN0000164091,NM_024795.1-1273s1c1,CCTCCTAAAGTGCTGCGATTA,pLKO.1,730,3UTR,90,89,,,Y,79853,TM4SF20,CCGGCCTCCTAAAGTGCTGCGATTACTCGAGTAATCGCAGCACTTTAGGAGGTTTTTG,AATTCAAAAACCTCCTAAAGTGCTGCGATTACTCGAGTAATCGCAGCACTTTAGGAGG,n/a
human,109729141,TDRKH-AS1,NR_146292.1,TRCN0000139826,NM_133477.1-4628s1c1,CCTCCTGAATAGCTGGGATTA,pLKO.1,596,3UTR,90,89,,,Y,171024,SYNPO2,CCGGCCTCCTGAATAGCTGGGATTACTCGAGTAATCCCAGCTATTCAGGAGGTTTTTG,AATTCAAAAACCTCCTGAATAGCTGGGATTACTCGAGTAATCCCAGCTATTCAGGAGG,n/a
human,109729141,TDRKH-AS1,NR_146292.1,TRCN0000165534,NM_001012717.1-362s1c1,GAGACAGGGTTTCACCATGTT,pLKO.1,662,3UTR,90,89,,,Y,,,CCGGGAGACAGGGTTTCACCATGTTCTCGAGAACATGGTGAAACCCTGTCTCTTTTTG,AATTCAAAAAGAGACAGGGTTTCACCATGTTCTCGAGAACATGGTGAAACCCTGTCTC,n/a
human,109729141,TDRKH-AS1,NR_146292.1,TRCN0000140238,NM_024895.3-1807s1c1,GTCTCCCAAAGTGCTAGGATT,pLKO.1,729,3UTR,90,89,,,Y,79955,PDZD7,CCGGGTCTCCCAAAGTGCTAGGATTCTCGAGAATCCTAGCACTTTGGGAGACTTTTTG,AATTCAAAAAGTCTCCCAAAGTGCTAGGATTCTCGAGAATCCTAGCACTTTGGGAGAC,n/a
human,109729141,TDRKH-AS1,NR_146292.1,TRCN0000129445,NM_145048.2-1500s1c1,GACTTCCAAAGTGCTGGGATT,pLKO.1,729,3UTR,90,89,,,Y,133015,PACRGL,CCGGGACTTCCAAAGTGCTGGGATTCTCGAGAATCCCAGCACTTTGGAAGTCTTTTTG,AATTCAAAAAGACTTCCAAAGTGCTGGGATTCTCGAGAATCCCAGCACTTTGGAAGTC,n/a
human,109729141,TDRKH-AS1,NR_146292.1,TRCN0000140759,NM_018265.1-3067s1c1,GCCTTTCAAAGTGCTGGGATT,pLKO.1,729,3UTR,90,89,,,Y,55765,INAVA,CCGGGCCTTTCAAAGTGCTGGGATTCTCGAGAATCCCAGCACTTTGAAAGGCTTTTTG,AATTCAAAAAGCCTTTCAAAGTGCTGGGATTCTCGAGAATCCCAGCACTTTGAAAGGC,n/a
human,109729141,TDRKH-AS1,NR_146292.1,TRCN0000155070,NM_017873.2-2761s1c1,GCCTTTCAAAGTGCTGGGATT,pLKO.1,729,3UTR,90,89,,,Y,140459,ASB6,CCGGGCCTTTCAAAGTGCTGGGATTCTCGAGAATCCCAGCACTTTGAAAGGCTTTTTG,AATTCAAAAAGCCTTTCAAAGTGCTGGGATTCTCGAGAATCCCAGCACTTTGAAAGGC,n/a
human,109729141,TDRKH-AS1,NR_146292.1,TRCN0000163829,NM_173639.1-1102s1c1,CCTCCCAAATTACTGGGATTA,pLKO.1,730,3UTR,90,89,,,Y,284618,RUSC1-AS1,CCGGCCTCCCAAATTACTGGGATTACTCGAGTAATCCCAGTAATTTGGGAGGTTTTTG,AATTCAAAAACCTCCCAAATTACTGGGATTACTCGAGTAATCCCAGTAATTTGGGAGG,n/a
human,109729141,TDRKH-AS1,NR_146292.1,TRCN0000057398,NM_002261.1-793s1c1,CCTCCCAAGTTGCTGGGATTA,pLKO.1,730,3UTR,90,89,,,Y,3823,KLRC3,CCGGCCTCCCAAGTTGCTGGGATTACTCGAGTAATCCCAGCAACTTGGGAGGTTTTTG,AATTCAAAAACCTCCCAAGTTGCTGGGATTACTCGAGTAATCCCAGCAACTTGGGAGG,n/a
human,109729141,TDRKH-AS1,NR_146292.1,TRCN0000140374,NM_025042.2-1098s1c1,GCTTCCCAAAGTACTGGGATT,pLKO.1,729,3UTR,90,89,,,Y,,,CCGGGCTTCCCAAAGTACTGGGATTCTCGAGAATCCCAGTACTTTGGGAAGCTTTTTG,AATTCAAAAAGCTTCCCAAAGTACTGGGATTCTCGAGAATCCCAGTACTTTGGGAAGC,n/a
human,109729141,TDRKH-AS1,NR_146292.1,TRCN0000029632,NM_000201.1-1572s1c1,CCAGCGGAAGATCAAGAAATA,pLKO.1,919,3UTR,85,89,,,Y,3383,ICAM1,CCGGCCAGCGGAAGATCAAGAAATACTCGAGTATTTCTTGATCTTCCGCTGGTTTTTG,AATTCAAAAACCAGCGGAAGATCAAGAAATACTCGAGTATTTCTTGATCTTCCGCTGG,n/a
human,109729141,TDRKH-AS1,NR_146292.1,TRCN0000002504,NM_004156.x-490s1c1,GCTTTAGTAGATGGACAGATA,pLKO.1,352,3UTR,85,89,,,Y,5516,PPP2CB,CCGGGCTTTAGTAGATGGACAGATACTCGAGTATCTGTCCATCTACTAAAGCTTTTTG,AATTCAAAAAGCTTTAGTAGATGGACAGATACTCGAGTATCTGTCCATCTACTAAAGC,n/a
human,109729141,TDRKH-AS1,NR_146292.1,TRCN0000157407,NM_001003795.1-3187s1c1,GATCTCGGCTTACTGCAACTT,pLKO.1,540,3UTR,85,89,,,Y,389524,GTF2IRD2B,CCGGGATCTCGGCTTACTGCAACTTCTCGAGAAGTTGCAGTAAGCCGAGATCTTTTTG,AATTCAAAAAGATCTCGGCTTACTGCAACTTCTCGAGAAGTTGCAGTAAGCCGAGATC,n/a
human,109729141,TDRKH-AS1,NR_146292.1,TRCN0000264189,NM_001085490.1-613s21c1,CAAGTAGCTGGGACTACAGGA,pLKO_005,601,3UTR,85,89,,,Y,285501,LINC01098,CCGGCAAGTAGCTGGGACTACAGGACTCGAGTCCTGTAGTCCCAGCTACTTGTTTTTG,AATTCAAAAACAAGTAGCTGGGACTACAGGACTCGAGTCCTGTAGTCCCAGCTACTTG,n/a
human,109729141,TDRKH-AS1,NR_146292.1,TRCN0000141125,NM_153233.1-1432s1c1,CAGGTTCAAGAGATTCTCCTA,pLKO.1,569,3UTR,85,89,,,Y,163183,SYNE4,CCGGCAGGTTCAAGAGATTCTCCTACTCGAGTAGGAGAATCTCTTGAACCTGTTTTTG,AATTCAAAAACAGGTTCAAGAGATTCTCCTACTCGAGTAGGAGAATCTCTTGAACCTG,n/a
human,109729141,TDRKH-AS1,NR_146292.1,TRCN0000130146,NM_207443.1-652s1c1,CAGGTTCAAGTGATTCTCCTA,pLKO.1,569,3UTR,85,89,,,Y,400242,DICER1-AS1,CCGGCAGGTTCAAGTGATTCTCCTACTCGAGTAGGAGAATCACTTGAACCTGTTTTTG,AATTCAAAAACAGGTTCAAGTGATTCTCCTACTCGAGTAGGAGAATCACTTGAACCTG,n/a
human,109729141,TDRKH-AS1,NR_146292.1,TRCN0000295802,NM_007916.2-563s21c1,GTGGAACCAGCAGACAGATAT,pLKO_005,913,3UTR,80,89,,,Y,13680,Ddx19a,CCGGGTGGAACCAGCAGACAGATATCTCGAGATATCTGTCTGCTGGTTCCACTTTTTG,AATTCAAAAAGTGGAACCAGCAGACAGATATCTCGAGATATCTGTCTGCTGGTTCCAC,n/a
human,109729141,TDRKH-AS1,NR_146292.1,TRCN0000415439,NM_014595.1-465s21c1,GACAAGGGACAAGACGGTGGT,pLKO_005,372,3UTR,80,89,,,Y,30833,NT5C,CCGGGACAAGGGACAAGACGGTGGTCTCGAGACCACCGTCTTGTCCCTTGTCTTTTTG,AATTCAAAAAGACAAGGGACAAGACGGTGGTCTCGAGACCACCGTCTTGTCCCTTGTC,n/a
human,109729141,TDRKH-AS1,NR_146292.1,TRCN0000263606,NM_025108.2-1464s21c1,GGCTCTTCTCAGGACAACTAA,pLKO_005,989,3UTR,81,85,,,Y,80178,TEDC2,CCGGGGCTCTTCTCAGGACAACTAACTCGAGTTAGTTGTCCTGAGAAGAGCCTTTTTG,AATTCAAAAAGGCTCTTCTCAGGACAACTAACTCGAGTTAGTTGTCCTGAGAAGAGCC,n/a
human,109729141,TDRKH-AS1,NR_146292.1,TRCN0000087398,XM_485956.1-980s1c1,CCTCCTATTCTTTGCGGAGAT,pLKO.1,413,3UTR,77,85,,,N,269959,Adamtsl3,CCGGCCTCCTATTCTTTGCGGAGATCTCGAGATCTCCGCAAAGAATAGGAGGTTTTTG,AATTCAAAAACCTCCTATTCTTTGCGGAGATCTCGAGATCTCCGCAAAGAATAGGAGG,n/a
