Taxon,"Gene ID","Gene Symbol",Transcript,"Clone ID","Legacy Clone Name","Target Seq",Vector,"Match Position","Match Region","Match %","SDR Match %","Intrinsic Score","Adjusted Score","Matches Other Gene in Same Taxon?","Orig. Target Gene ID","Orig. Target Gene Symbol","Forward Oligo Sequence","Reverse Oligo Sequence",Addgene
human,257,ALX3,NM_006492.3,TRCN0000013540,NM_006492.1-447s1c1,CAAGAGCAAGAAGCGTCGTAA,pLKO.1,507,CDS,100,100,4.95,6.93,N,257,ALX3,CCGGCAAGAGCAAGAAGCGTCGTAACTCGAGTTACGACGCTTCTTGCTCTTGTTTTTG,AATTCAAAAACAAGAGCAAGAAGCGTCGTAACTCGAGTTACGACGCTTCTTGCTCTTG,n/a
human,257,ALX3,NM_006492.3,TRCN0000425444,NM_006492.2-557s21c1,CGCACGACCTTCAGCACATTC,pLKO_005,529,CDS,100,100,3.6,2.88,N,257,ALX3,CCGGCGCACGACCTTCAGCACATTCCTCGAGGAATGTGCTGAAGGTCGTGCGTTTTTG,AATTCAAAAACGCACGACCTTCAGCACATTCCTCGAGGAATGTGCTGAAGGTCGTGCG,n/a
human,257,ALX3,NM_006492.3,TRCN0000422390,NM_006492.2-892s21c1,CCCATGCATGTCTCCATATTC,pLKO_005,864,CDS,100,100,13.2,9.24,N,257,ALX3,CCGGCCCATGCATGTCTCCATATTCCTCGAGGAATATGGAGACATGCATGGGTTTTTG,AATTCAAAAACCCATGCATGTCTCCATATTCCTCGAGGAATATGGAGACATGCATGGG,n/a
human,257,ALX3,NM_006492.3,TRCN0000013539,NM_006492.1-940s1c1,CCTTCCTCAGATGGTGACTAT,pLKO.1,1000,CDS,100,100,4.95,3.465,N,257,ALX3,CCGGCCTTCCTCAGATGGTGACTATCTCGAGATAGTCACCATCTGAGGAAGGTTTTTG,AATTCAAAAACCTTCCTCAGATGGTGACTATCTCGAGATAGTCACCATCTGAGGAAGG,n/a
human,257,ALX3,NM_006492.3,TRCN0000013542,NM_006492.1-883s1c1,CCTGGCATCTACTCCATCCAT,pLKO.1,943,CDS,100,100,3,2.1,N,257,ALX3,CCGGCCTGGCATCTACTCCATCCATCTCGAGATGGATGGAGTAGATGCCAGGTTTTTG,AATTCAAAAACCTGGCATCTACTCCATCCATCTCGAGATGGATGGAGTAGATGCCAGG,n/a
human,257,ALX3,NM_006492.3,TRCN0000013538,NM_006492.1-1343s1c1,CCAGACTTTGTCCAAGTCCAT,pLKO.1,1375,3UTR,100,100,.264,.1848,N,257,ALX3,CCGGCCAGACTTTGTCCAAGTCCATCTCGAGATGGACTTGGACAAAGTCTGGTTTTTG,AATTCAAAAACCAGACTTTGTCCAAGTCCATCTCGAGATGGACTTGGACAAAGTCTGG,n/a
human,257,ALX3,NM_006492.3,TRCN0000013541,NM_006492.1-277s1c1,GCTGAGGAGAAGACCTCCAAA,pLKO.1,337,CDS,100,100,4.95,2.97,N,257,ALX3,CCGGGCTGAGGAGAAGACCTCCAAACTCGAGTTTGGAGGTCTTCTCCTCAGCTTTTTG,AATTCAAAAAGCTGAGGAGAAGACCTCCAAACTCGAGTTTGGAGGTCTTCTCCTCAGC,n/a
human,257,ALX3,NM_006492.3,TRCN0000081722,NM_007441.1-778s1c1,GCGTGAGCGTTATGGGAAGAT,pLKO.1,690,CDS,95,95,,,N,11694,Alx3,CCGGGCGTGAGCGTTATGGGAAGATCTCGAGATCTTCCCATAACGCTCACGCTTTTTG,AATTCAAAAAGCGTGAGCGTTATGGGAAGATCTCGAGATCTTCCCATAACGCTCACGC,n/a
human,257,ALX3,NM_006492.3,TRCN0000081720,NM_007441.1-1031s1c1,CCTGGCATCTATTCCATCCAT,pLKO.1,943,CDS,95,95,,,N,11694,Alx3,CCGGCCTGGCATCTATTCCATCCATCTCGAGATGGATGGAATAGATGCCAGGTTTTTG,AATTCAAAAACCTGGCATCTATTCCATCCATCTCGAGATGGATGGAATAGATGCCAGG,n/a
human,257,ALX3,NM_006492.3,TRCN0000240652,XM_987021.1-563s21c1,TCTGGTTCCAGAACCGCCGAA,pLKO_005,656,CDS,90,95,,,Y,672284,Nkx1-1,CCGGTCTGGTTCCAGAACCGCCGAACTCGAGTTCGGCGGTTCTGGAACCAGATTTTTG,AATTCAAAAATCTGGTTCCAGAACCGCCGAACTCGAGTTCGGCGGTTCTGGAACCAGA,n/a
human,257,ALX3,NM_006492.3,TRCN0000275104,NM_002503.3-318s21c1,TGGACCTGCAGAATGACCTAG,pLKO_005,1102,3UTR,85,95,,,Y,4793,NFKBIB,CCGGTGGACCTGCAGAATGACCTAGCTCGAGCTAGGTCATTCTGCAGGTCCATTTTTG,AATTCAAAAATGGACCTGCAGAATGACCTAGCTCGAGCTAGGTCATTCTGCAGGTCCA,n/a
human,257,ALX3,NM_006492.3,TRCN0000422606,NM_152568.2-168s21c1,TGTGGTTCCAGAACCGCAGGA,pLKO_005,656,CDS,85,95,,,Y,157848,NKX6-3,CCGGTGTGGTTCCAGAACCGCAGGACTCGAGTCCTGCGGTTCTGGAACCACATTTTTG,AATTCAAAAATGTGGTTCCAGAACCGCAGGACTCGAGTCCTGCGGTTCTGGAACCACA,n/a
human,257,ALX3,NM_006492.3,TRCN0000583910,,CACCATCATGTCTCCATATTT,pLKO_005,863,CDS,86,90,,,Y,26184,OR1F2P,CCGGCACCATCATGTCTCCATATTTCTCGAGAAATATGGAGACATGATGGTGTTTTTG,AATTCAAAAACACCATCATGTCTCCATATTTCTCGAGAAATATGGAGACATGATGGTG,n/a
human,257,ALX3,NM_006492.3,TRCN0000134130,XM_379801.1-479s1c1,CCACAGTATTTGGTATCTCTT,pLKO.1,1735,3UTR,90,89,,,Y,23080,AVL9,CCGGCCACAGTATTTGGTATCTCTTCTCGAGAAGAGATACCAAATACTGTGGTTTTTG,AATTCAAAAACCACAGTATTTGGTATCTCTTCTCGAGAAGAGATACCAAATACTGTGG,n/a
human,257,ALX3,NM_006492.3,TRCN0000043977,NM_002420.3-3549s1c1,CGTGGATTGAAGCTCTTCCTT,pLKO.1,1470,3UTR,85,89,,,Y,4308,TRPM1,CCGGCGTGGATTGAAGCTCTTCCTTCTCGAGAAGGAAGAGCTTCAATCCACGTTTTTG,AATTCAAAAACGTGGATTGAAGCTCTTCCTTCTCGAGAAGGAAGAGCTTCAATCCACG,n/a
human,257,ALX3,NM_006492.3,TRCN0000446331,NM_001080461.1-587s21c1,AGCTGGAGAAGATGGAGAAGA,pLKO_005,551,CDS,85,89,,,Y,340260,UNCX,CCGGAGCTGGAGAAGATGGAGAAGACTCGAGTCTTCTCCATCTTCTCCAGCTTTTTTG,AATTCAAAAAAGCTGGAGAAGATGGAGAAGACTCGAGTCTTCTCCATCTTCTCCAGCT,n/a
human,257,ALX3,NM_006492.3,TRCN0000440275,NM_001080461.1-443s21c1,GAGTTCAGGTCTGGTTCCAAA,pLKO_005,647,CDS,85,89,,,Y,340260,UNCX,CCGGGAGTTCAGGTCTGGTTCCAAACTCGAGTTTGGAACCAGACCTGAACTCTTTTTG,AATTCAAAAAGAGTTCAGGTCTGGTTCCAAACTCGAGTTTGGAACCAGACCTGAACTC,n/a
human,257,ALX3,NM_006492.3,TRCN0000427507,NM_031944.1-390s21c1,CCAGGTATGGTTCCAGAACAG,pLKO_005,651,CDS,85,89,,,Y,83881,MIXL1,CCGGCCAGGTATGGTTCCAGAACAGCTCGAGCTGTTCTGGAACCATACCTGGTTTTTG,AATTCAAAAACCAGGTATGGTTCCAGAACAGCTCGAGCTGTTCTGGAACCATACCTGG,n/a
human,257,ALX3,NM_006492.3,TRCN0000069384,NM_153512.1-1058s1c1,CCCTATTACATCTCTGTGCTA,pLKO.1,739,CDS,85,89,,,Y,225030,Kcng3,CCGGCCCTATTACATCTCTGTGCTACTCGAGTAGCACAGAGATGTAATAGGGTTTTTG,AATTCAAAAACCCTATTACATCTCTGTGCTACTCGAGTAGCACAGAGATGTAATAGGG,n/a
human,257,ALX3,NM_006492.3,TRCN0000083971,NM_012292.1-1111s1c1,CAAGTACATGAAGGACCTCAT,pLKO.1,267,CDS,80,89,,,Y,23526,ARHGAP45,CCGGCAAGTACATGAAGGACCTCATCTCGAGATGAGGTCCTTCATGTACTTGTTTTTG,AATTCAAAAACAAGTACATGAAGGACCTCATCTCGAGATGAGGTCCTTCATGTACTTG,n/a
human,257,ALX3,NM_006492.3,TRCN0000157460,NM_032865.3-1022s1c1,GCCATCAGTCATCTTCCAGAT,pLKO.1,1684,3UTR,77,85,,,Y,84951,TNS4,CCGGGCCATCAGTCATCTTCCAGATCTCGAGATCTGGAAGATGACTGATGGCTTTTTG,AATTCAAAAAGCCATCAGTCATCTTCCAGATCTCGAGATCTGGAAGATGACTGATGGC,n/a
