Taxon,"Gene ID","Gene Symbol",Transcript,"Clone ID","Legacy Clone Name","Target Seq",Vector,"Match Position","Match Region","Match %","SDR Match %","Intrinsic Score","Adjusted Score","Matches Other Gene in Same Taxon?","Orig. Target Gene ID","Orig. Target Gene Symbol","Forward Oligo Sequence","Reverse Oligo Sequence",Addgene
human,347862,GATD1,XM_011520064.2,TRCN0000142695,NM_182612.1-359s1c1,CACTTCCACTCTGAGAGCAAA,pLKO.1,362,CDS,100,100,4.95,3.465,N,347862,GATD1,CCGGCACTTCCACTCTGAGAGCAAACTCGAGTTTGCTCTCAGAGTGGAAGTGTTTTTG,AATTCAAAAACACTTCCACTCTGAGAGCAAACTCGAGTTTGCTCTCAGAGTGGAAGTG,n/a
human,347862,GATD1,XM_011520064.2,TRCN0000141816,NM_182612.1-182s1c1,GTGGATGTGACTGAGAGCAAT,pLKO.1,185,CDS,100,100,4.95,3.465,N,347862,GATD1,CCGGGTGGATGTGACTGAGAGCAATCTCGAGATTGCTCTCAGTCACATCCACTTTTTG,AATTCAAAAAGTGGATGTGACTGAGAGCAATCTCGAGATTGCTCTCAGTCACATCCAC,n/a
human,347862,GATD1,XM_011520064.2,TRCN0000143864,NM_182612.1-171s1c1,CCATGGAATTTGTGGATGTGA,pLKO.1,174,CDS,100,100,3,2.1,N,347862,GATD1,CCGGCCATGGAATTTGTGGATGTGACTCGAGTCACATCCACAAATTCCATGGTTTTTG,AATTCAAAAACCATGGAATTTGTGGATGTGACTCGAGTCACATCCACAAATTCCATGG,n/a
human,347862,GATD1,XM_011520064.2,TRCN0000141415,NM_182612.1-103s1c1,CTTCCTCCACTGTTTCACGAT,pLKO.1,106,CDS,100,100,2.64,1.848,N,347862,GATD1,CCGGCTTCCTCCACTGTTTCACGATCTCGAGATCGTGAAACAGTGGAGGAAGTTTTTG,AATTCAAAAACTTCCTCCACTGTTTCACGATCTCGAGATCGTGAAACAGTGGAGGAAG,n/a
human,347862,GATD1,XM_011520064.2,TRCN0000142618,NM_182612.1-185s1c1,GATGTGACTGAGAGCAATGCA,pLKO.1,188,CDS,100,100,3,1.8,N,347862,GATD1,CCGGGATGTGACTGAGAGCAATGCACTCGAGTGCATTGCTCTCAGTCACATCTTTTTG,AATTCAAAAAGATGTGACTGAGAGCAATGCACTCGAGTGCATTGCTCTCAGTCACATC,n/a
human,347862,GATD1,XM_011520064.2,TRCN0000113224,NM_172116.2-378s1c1,CCGCTCTGAGAGCAAACCCAT,pLKO.1,367,CDS,95,95,,,N,213350,Gatd1,CCGGCCGCTCTGAGAGCAAACCCATCTCGAGATGGGTTTGCTCTCAGAGCGGTTTTTG,AATTCAAAAACCGCTCTGAGAGCAAACCCATCTCGAGATGGGTTTGCTCTCAGAGCGG,n/a
human,347862,GATD1,XM_011520064.2,TRCN0000230962,XM_001715289.1-621s21c1,ACTCTGAGAGCACAGCCATCA,pLKO_005,369,CDS,85,89,,,Y,653333,FAM86B2,CCGGACTCTGAGAGCACAGCCATCACTCGAGTGATGGCTGTGCTCTCAGAGTTTTTTG,AATTCAAAAAACTCTGAGAGCACAGCCATCACTCGAGTGATGGCTGTGCTCTCAGAGT,n/a
human,347862,GATD1,XM_011520064.2,TRCN0000366155,NM_018783.4-625s21c1,GAGGACTTCCCGAAGGATTTA,pLKO_005,533,CDS,80,89,,,Y,54723,Tfip11,CCGGGAGGACTTCCCGAAGGATTTACTCGAGTAAATCCTTCGGGAAGTCCTCTTTTTG,AATTCAAAAAGAGGACTTCCCGAAGGATTTACTCGAGTAAATCCTTCGGGAAGTCCTC,n/a
human,347862,GATD1,XM_011520064.2,TRCN0000057368,NM_006149.2-906s1c1,CGCTTCAAGGTTTACGCCAAT,pLKO.1,227,CDS,80,89,,,Y,3960,LGALS4,CCGGCGCTTCAAGGTTTACGCCAATCTCGAGATTGGCGTAAACCTTGAAGCGTTTTTG,AATTCAAAAACGCTTCAAGGTTTACGCCAATCTCGAGATTGGCGTAAACCTTGAAGCG,n/a
