Taxon,"Gene ID","Gene Symbol",Transcript,"Clone ID","Legacy Clone Name","Target Seq",Vector,"Match Position","Match Region","Match %","SDR Match %","Intrinsic Score","Adjusted Score","Matches Other Gene in Same Taxon?","Orig. Target Gene ID","Orig. Target Gene Symbol","Forward Oligo Sequence","Reverse Oligo Sequence",Addgene
human,7123,CLEC3B,XM_017007117.2,TRCN0000371799,NM_003278.2-636s21c1,CAACGGCAAGTGGTTCGACAA,pLKO_005,1158,CDS,100,100,4.05,5.67,N,7123,CLEC3B,CCGGCAACGGCAAGTGGTTCGACAACTCGAGTTGTCGAACCACTTGCCGTTGTTTTTG,AATTCAAAAACAACGGCAAGTGGTTCGACAACTCGAGTTGTCGAACCACTTGCCGTTG,n/a
human,7123,CLEC3B,XM_017007117.2,TRCN0000062477,NM_003278.1-318s1c1,CAAGGTGCACATGAAATGCTT,pLKO.1,843,CDS,100,100,3,2.4,N,7123,CLEC3B,CCGGCAAGGTGCACATGAAATGCTTCTCGAGAAGCATTTCATGTGCACCTTGTTTTTG,AATTCAAAAACAAGGTGCACATGAAATGCTTCTCGAGAAGCATTTCATGTGCACCTTG,n/a
human,7123,CLEC3B,XM_017007117.2,TRCN0000062476,NM_003278.1-550s1c1,GCCTACAAGAACTGGGAGACT,pLKO.1,1075,CDS,100,100,2.64,1.584,N,7123,CLEC3B,CCGGGCCTACAAGAACTGGGAGACTCTCGAGAGTCTCCCAGTTCTTGTAGGCTTTTTG,AATTCAAAAAGCCTACAAGAACTGGGAGACTCTCGAGAGTCTCCCAGTTCTTGTAGGC,n/a
human,7123,CLEC3B,XM_017007117.2,TRCN0000119433,NM_011606.1-762s1c1,CCGCGATCAGTTGCCCTACAT,pLKO.1,1185,CDS,95,95,,,N,21922,Clec3b,CCGGCCGCGATCAGTTGCCCTACATCTCGAGATGTAGGGCAACTGATCGCGGTTTTTG,AATTCAAAAACCGCGATCAGTTGCCCTACATCTCGAGATGTAGGGCAACTGATCGCGG,n/a
human,7123,CLEC3B,XM_017007117.2,TRCN0000375992,NM_023854.1-2031s21c1,TATCAGCCCTCAGGGAGAAGT,pLKO_005,755,CDS,85,89,,,Y,77038,Arfgap2,CCGGTATCAGCCCTCAGGGAGAAGTCTCGAGACTTCTCCCTGAGGGCTGATATTTTTG,AATTCAAAAATATCAGCCCTCAGGGAGAAGTCTCGAGACTTCTCCCTGAGGGCTGATA,n/a
human,7123,CLEC3B,XM_017007117.2,TRCN0000184382,NM_145006.2-483s1c1,GCTGAAAGATGAGGACTTGGA,pLKO.1,52,5UTR,80,89,,,Y,203328,SUSD3,CCGGGCTGAAAGATGAGGACTTGGACTCGAGTCCAAGTCCTCATCTTTCAGCTTTTTG,AATTCAAAAAGCTGAAAGATGAGGACTTGGACTCGAGTCCAAGTCCTCATCTTTCAGC,n/a
human,7123,CLEC3B,XM_017007117.2,TRCN0000055347,NM_009045.2-1503s1c1,TCTGTGGACAACTCAGAGTTT,pLKO.1,642,CDS,80,89,,,Y,19697,Rela,CCGGTCTGTGGACAACTCAGAGTTTCTCGAGAAACTCTGAGTTGTCCACAGATTTTTG,AATTCAAAAATCTGTGGACAACTCAGAGTTTCTCGAGAAACTCTGAGTTGTCCACAGA,n/a
human,7123,CLEC3B,XM_017007117.2,TRCN0000256889,NM_145662.2-111s21c1,TTCCAACGAGGCCAACGAGAT,pLKO_005,889,CDS,80,89,,,Y,728712,SPANXA2,CCGGTTCCAACGAGGCCAACGAGATCTCGAGATCTCGTTGGCCTCGTTGGAATTTTTG,AATTCAAAAATTCCAACGAGGCCAACGAGATCTCGAGATCTCGTTGGCCTCGTTGGAA,n/a
human,7123,CLEC3B,XM_017007117.2,TRCN0000140844,NM_001013739.1-783s1c1,CAGAGGACTTTCTTCCAGCTT,pLKO.1,60,5UTR,80,89,,,Y,442578,STAG3L3,CCGGCAGAGGACTTTCTTCCAGCTTCTCGAGAAGCTGGAAGAAAGTCCTCTGTTTTTG,AATTCAAAAACAGAGGACTTTCTTCCAGCTTCTCGAGAAGCTGGAAGAAAGTCCTCTG,n/a
human,7123,CLEC3B,XM_017007117.2,TRCN0000040181,NM_000548.2-413s1c1,CCAACGAAGACCTTCACGAAA,pLKO.1,877,CDS,77,85,,,Y,7249,TSC2,CCGGCCAACGAAGACCTTCACGAAACTCGAGTTTCGTGAAGGTCTTCGTTGGTTTTTG,AATTCAAAAACCAACGAAGACCTTCACGAAACTCGAGTTTCGTGAAGGTCTTCGTTGG,n/a
